program: Gaussian 09
title: 000259834
version: EM64L-G09RevD.01
frameworkgroup: C1[X(C9H11NO2)]
method: RPBEPBE
basis: SDD
operation: Freq
keyword: #p
keyword: freq=noraman
keyword: PBEPBE/SDD
title: #p freq=noraman PBEPBE/SDD
converged: YES YES NO NO
title: Mulliken charges:
elementType: O O N C C C C C C C C C H H H H H H H H H H H
charge: -0.442703 -0.326098 -0.679967 0.372233 0.146389 0.501867 0.119725 -0.551434 -0.551281 -0.847083 -0.818197 0.121325 0.231797 0.275482 0.227796 0.228394 0.238601 0.225280 0.227676 0.225527 0.319923 0.373516 0.381234
chargesum: 0.00000
title: Mulliken charges with hydrogens summed into heavy atoms:
elementType: O O N C C C C C C C C C
charge: -0.061469 -0.326098 0.013472 0.372233 0.146389 0.501867 0.119725 -0.319638 -0.275799 -0.152293 -0.139715 0.121325
polarizability: 1.51593088e+02 1.73052704e+00 1.41911100e+02 -6.13820875e-03 -4.59823361e-03 5.57209606e+01
1716.lowfreq: -10.9352 -7.8436 -5.5432 -0.0007 -0.0005 0.0007 56.6084 76.9820 117.5223
frequency: 56.4637 76.9797 117.5200 155.2586 194.4612 197.6045 211.9173 267.0363 346.5955 352.6067 366.5348 414.3882 416.5220 456.1052 467.8567 516.1603 563.5237 576.3458 579.2741 627.0243 696.4053 750.0812 778.7287 785.8106 869.1866 890.5743 929.4504 958.9402 983.8273 1017.9625 1030.6060 1043.5646 1053.2789 1132.3745 1165.9538 1258.1896 1271.4917 1315.4693 1342.9962 1394.6268 1398.0915 1401.5182 1422.4931 1466.7096 1470.4592 1473.2301 1478.9091 1497.3979 1565.8471 1588.6429 1630.7491 1644.9495 2954.3873 2971.3861 3021.7219 3046.0181 3082.6113 3087.2732 3108.2956 3162.5062 3399.6417 3533.0540 3659.9476
redmass: 1.0564 5.0209 5.6320 3.0472 1.3995 4.5717 1.8992 2.6756 4.1882 3.0893 6.3898 6.4070 1.3064 5.3425 2.2319 4.0115 2.6382 1.3013 3.6282 4.3862 5.3129 1.2570 3.3248 4.4045 4.1898 1.3736 1.3699 4.1743 1.8560 1.4532 1.9597 1.5020 1.5453 1.5126 1.7107 2.4695 1.5037 3.0380 3.9589 1.7578 1.4782 1.7571 3.3578 2.1769 1.0458 1.0449 1.1220 1.5126 2.8116 6.5749 1.6951 6.7796 1.0395 1.0375 1.0975 1.0978 1.0981 1.0955 1.0912 1.0919 1.0575 1.0640 1.0926
irintensity: 0.2049 0.4053 0.0810 7.9490 0.2903 0.0126 0.2980 2.4150 1.8999 1.7667 11.6222 2.9944 110.1257 1.0891 11.5136 9.2164 38.2819 142.5138 1.3328 43.0687 0.0743 71.4066 79.9119 2.8196 7.1417 13.0713 0.8722 1.2594 75.8662 11.8093 258.8981 0.5351 15.9407 147.9547 12.6591 12.2895 4.3075 2.7157 143.4369 19.5251 4.2080 7.0587 24.5120 51.9050 15.9147 11.3075 7.5860 19.8643 408.5371 93.0886 54.4747 132.0768 43.9047 51.8996 25.1821 25.7861 16.2561 12.7721 25.2357 2.6076 113.9885 51.6026 53.1484
temp: 298.150 k
press: 1.00000 atm
elementType: 8 8 7 6 6 6 6 6 6 6 6 6 1 1 1 1 1 1 1 1 1 1 1
symmnumber: 1
zpe: 482666.5 jmol-1
zpe.correction: 0.183838 hartree
zpe.thermalcorrener: 0.195702 hartree
zpe.thermalcorrenthalpy: 0.196646 hartree
zpe.thermalcorrgfe: 0.146273 hartree
zpe.sumelectzpe: -553.909849 hartree
zpe.sumelectthermal: -553.897985 hartree
zpe.sumelectthermalent: -553.897041 hartree
zpe.sumelectthermalfe: -553.947414 hartree
dipole: -1.7751 1.0283 -0.0022
dipole: 2.0515
quadrupole: -65.5975 -60.4773 -74.4323
quadrupole: -4.6305 -0.0213 -0.0133
quadrupole: 1.2382 6.3584 -7.5966 -4.6305 -0.0213 -0.0133
hfenergy: -554.0936866 hartree
pointgroup: C01 [X(C9H11N1O2)]
dipole: -0.6968996 -0.407088 -0.0055121 debye
dipolederiv: -0.6163039 -0.465267 -0.0140745 -0.7018179 -1.1210494 -0.016516 -0.0222311 -0.0189432 -0.4230919 -1.1823209 0.1806382 0.0144392 0.3317513 -0.7096232 -0.0154678 0.0198603 -0.0134783 -0.3624917 -0.5214551 0.5654312 0.0175737 0.348162 -1.1015816 -0.016694 0.0104219 -0.0166479 -0.6361544 -0.0850524 0.6364406 0.0200822 0.125118 0.0121779 0.0012587 0.0033903 -0.0035404 -0.06749 0.3900822 -0.8259228 -0.0287792 -0.2518144 0.8956438 0.0265569 -0.0101916 0.031316 0.0918708 -0.2850121 -0.457486 -0.0123344 -0.376435 -0.0571737 0.0037269 -0.0087073 0.0031878 -0.0668951 -1.0327277 -0.4015817 -0.0030831 0.1818848 -0.2394602 -0.0078347 0.0155458 -0.0026661 -0.0432024 0.111978 -0.0051584 -0.0023943 0.2514288 0.2928693 0.0120013 0.0058709 0.014906 -0.1582119 0.4181878 0.2899385 0.0041462 -0.3417123 -0.1168663 0.0039259 -0.0166395 -0.0020891 -0.1320711 0.03575 -0.034518 -0.0006504 -0.0351302 -0.0647058 -0.0045701 -0.0002669 -0.0035785 0.096846 -0.0105511 0.0825418 0.0035584 0.0474882 0.0158232 -0.0028224 0.0010525 -0.0019556 0.0887685 2.1302325 0.4046465 -0.0060567 0.3031517 1.3349713 0.0353641 -0.009206 0.0338922 0.2213254 -0.1324609 -0.0232805 0.0016495 -0.0287469 0.0974577 -0.0010163 0.0014262 -0.0012468 0.1344237 0.1138199 -0.0443542 -0.0010516 -0.035727 -0.0179058 -0.005231 -0.000838 -0.0053034 0.1514598 0.0769076 0.0397949 0.0830319 -0.0333961 -0.047341 -0.0871667 0.022236 -0.1248736 -0.0577944 0.0757937 0.0455058 -0.081589 -0.0313312 -0.0599453 0.0872419 -0.0257004 0.1238483 -0.0437643 -0.1375211 -0.0465928 -0.0000238 0.0789533 0.0919564 -0.0010632 0.004041 -0.0003224 0.1109425 -0.0247615 0.0742262 0.1179493 0.0370935 0.0387328 0.0253689 0.1468981 -0.0481041 -0.0555656 0.0135528 -0.1576212 -0.0053544 -0.0325129 -0.0845556 -0.0069446 -0.0005255 -0.0061263 0.1068654 -0.0270041 0.0834616 -0.1124856 0.0484433 0.036256 -0.0188527 -0.1441201 0.0539282 -0.0516437 0.189691 -0.0505814 -0.0008368 -0.0575985 0.2046584 -0.004075 -0.0007043 -0.0053029 0.3420013 0.3182453 0.0293635 0.0012212 0.0009136 0.2767922 -0.0029405 -0.0000513 -0.0038318 0.3607739 0.18093 0.0803752 0.0050622 0.1718338 0.3228688 -0.0042496 0.008439 -0.0030681 0.3930992 unknown
polarizability: 151.5967427|-1.6665016|141.8106606|-0.9559847|2.7568809|55.817745 unknown
InChI: InChI=1S/C9H11NO2/c1-5-3-6(2)8(10)7(4-5)9(11)12/h3-4,11H,10H2,1-2H3
charge 0 multiplicity 1
23 atoms
O  2.64592 1.675854 0.001066
O  3.01298 -0.604258 -0.080305
N  0.872866 -2.219243 -0.106429
C  -1.332269 -1.161457 -0.054059
C  0.105424 -1.07164 -0.064443
C  -1.502952 1.320795 0.027188
C  0.715881 0.234267 -0.028077
C  -2.088979 0.018968 -0.009418
C  -0.103795 1.401518 0.017341
C  -1.998936 -2.523315 -0.090411
C  -2.378243 2.560856 0.074463
C  2.174441 0.35328 -0.038965
H  -3.184188 -0.065846 -0.002264
H  0.395572 2.374479 0.044657
H  -1.728035 -3.09266 -1.002828
H  -1.717246 -3.145036 0.783618
H  -3.096961 -2.425184 -0.08129
H  -3.032513 2.56304 0.967195
H  -1.768574 3.479988 0.105326
H  -3.038378 2.626839 -0.811554
H  0.435951 -3.135373 -0.134078
H  1.894623 -2.110781 -0.110521
H  3.639713 1.644608 -0.011014
