program: Gaussian 09
title: 000259853
version: EM64L-G09RevD.01
frameworkgroup: C1[X(C10H13N5O4)]
method: RPBEPBE
basis: SDD
operation: Freq
keyword: #p
keyword: freq=noraman
keyword: PBEPBE/SDD
title: #p freq=noraman PBEPBE/SDD
converged: YES YES NO NO
title: Mulliken charges:
elementType: O O O O N N N N N C C C C C C C C C C H H H H H H H H H H H H H
charge: -0.239254 -0.436765 -0.447592 -0.458563 -0.175111 -0.086793 -0.053390 -0.063134 -0.610229 -0.084842 -0.051093 -0.187555 -0.139042 -0.391132 0.168880 -0.181378 -0.099257 0.167411 -0.362143 0.198147 0.261686 0.263754 0.254419 0.218336 0.261755 0.260120 0.368007 0.364785 0.359357 0.243468 0.333164 0.343985
chargesum: 0.00000
title: Mulliken charges with hydrogens summed into heavy atoms:
elementType: O O O O N N N N N C C C C C C C C C C
charge: -0.239254 -0.068758 -0.082807 -0.099207 -0.175111 -0.086793 -0.053390 -0.063134 0.066920 0.113304 0.210594 0.076199 0.115376 0.088959 0.168880 0.078742 -0.099257 0.167411 -0.118675
polarizability: 2.17293680e+02 7.65286482e-01 1.40293496e+02 -2.82965874e+00 1.95988110e+01 1.08880806e+02
1716.lowfreq: -12.3440 -3.4085 -0.0006 -0.0002 0.0003 7.4343 18.8130 40.2489 56.5523
frequency: 18.4097 40.0129 56.5120 104.7344 113.0756 139.1327 192.6611 202.9979 219.9815 233.7418 253.4252 267.2479 282.7053 343.1883 359.5084 393.2353 409.6246 432.8622 455.7391 475.3467 503.6467 509.7888 511.6822 544.0630 562.2934 564.1917 580.4771 609.4276 622.1769 646.1052 669.9354 707.0489 722.8418 789.3656 790.8746 819.7799 837.4884 851.0029 874.5597 890.0574 928.8617 933.3331 959.4855 995.7819 1015.0823 1024.6709 1042.7489 1059.1050 1062.6717 1113.1645 1142.7033 1181.0802 1190.4130 1209.8955 1223.5345 1240.2219 1247.1546 1253.8369 1279.5576 1289.2250 1304.6519 1313.4843 1322.0358 1342.3208 1351.9112 1358.8828 1363.2428 1373.1830 1382.3280 1387.7055 1414.9224 1434.2985 1449.9060 1468.2386 1547.9134 1579.8641 1633.8088 2932.9695 2977.7542 2994.0894 3041.4642 3068.5698 3100.3649 3166.8115 3244.3524 3474.9797 3514.8142 3523.0326 3540.5202 3695.6913
redmass: 6.3026 6.4621 5.8844 5.9799 6.5672 6.5312 6.4083 5.6166 5.4376 5.8754 5.7934 5.0725 4.4505 5.9347 3.9499 2.6389 4.6208 1.1119 1.1450 3.7569 4.6590 7.5635 1.2389 1.0513 4.1006 4.0315 1.1659 3.7344 6.3361 4.5228 8.2193 6.9794 5.1537 4.9947 3.5867 2.0666 4.2693 8.5823 4.5140 2.3982 1.4539 3.7495 2.4835 3.1356 3.6759 3.3029 3.5002 3.5023 2.8042 2.7900 3.0148 1.2126 1.9893 1.5284 1.5907 1.5213 1.5581 1.2188 3.5666 1.2501 2.0254 2.9337 4.3231 1.2636 1.3257 1.3729 1.7609 1.5691 1.2794 3.6804 1.7680 2.8560 1.0927 4.2570 8.2972 1.8394 2.8277 1.0820 1.0665 1.0852 1.0852 1.0875 1.0983 1.0921 1.0983 1.0647 1.0654 1.0653 1.0443 1.1056
irintensity: 0.4212 0.7303 1.8642 7.6233 2.5486 0.9072 0.0133 1.5911 4.5081 18.4184 14.2315 12.7215 7.6394 0.5712 2.7623 7.4296 1.1419 53.6996 90.6563 14.1238 4.9476 4.4404 267.3487 0.1955 1.7335 1.4483 208.8431 37.5110 9.0434 52.8679 2.4881 23.7844 0.1640 61.5347 14.7316 8.8000 31.8845 6.5164 56.4784 22.0967 9.7182 151.8681 3.9422 27.0326 130.2074 94.3789 27.9984 32.2630 14.7147 5.3212 27.9800 58.4372 41.5583 18.8221 74.3921 33.4581 29.2547 16.0850 159.1138 19.6520 12.3868 21.4627 2.3655 3.8775 7.8524 95.1470 40.2206 1.9123 34.6582 16.0563 7.9205 107.5556 16.4462 55.2313 66.1906 33.1983 612.5860 36.0984 34.4459 9.8189 15.1746 33.3892 13.6319 16.9518 0.0216 32.4935 12.8956 21.2713 126.9683 49.6460
temp: 298.150 k
press: 1.00000 atm
elementType: 8 8 8 8 7 7 7 7 7 6 6 6 6 6 6 6 6 6 6 1 1 1 1 1 1 1 1 1 1 1 1 1
symmnumber: 1
zpe: 641782.1 jmol-1
zpe.correction: 0.244442 hartree
zpe.thermalcorrener: 0.260906 hartree
zpe.thermalcorrenthalpy: 0.261850 hartree
zpe.thermalcorrgfe: 0.199735 hartree
zpe.sumelectzpe: -962.081157 hartree
zpe.sumelectthermal: -962.064693 hartree
zpe.sumelectthermalent: -962.063749 hartree
zpe.sumelectthermalfe: -962.125865 hartree
dipole: 1.6223 -0.2408 -1.4498
dipole: 2.1890
quadrupole: -103.5247 -106.2519 -115.8092
quadrupole: 10.5741 2.2238 3.0882
quadrupole: 5.0039 2.2767 -7.2806 10.5741 2.2238 3.0882
hfenergy: -962.3255992 hartree
pointgroup: C01 [X(C10H13N5O4)]
dipole: -0.6605401 0.521699 -0.18222 debye
polarizability: 217.3403223|1.3801606|132.2733729|0.3398183|23.9502027|116.8542867 unknown
InChI: InChI=1S/C10H13N5O4/c11-8-5-9(13-2-12-8)15(3-14-5)10-7(18)6(17)4(16)1-19-10/h2-4,6-7,10,16-18H,1,11H2
charge 0 multiplicity 1
32 atoms
O  -1.547068 0.469549 -1.404371
O  -1.568401 -0.979403 2.029807
O  -4.416285 -0.727783 1.410449
O  -4.338931 1.131264 -0.688195
N  0.262604 0.282638 0.122511
N  1.857425 1.705493 0.958471
N  1.742493 -1.383477 -0.978463
N  4.123421 -0.826427 -0.701355
N  4.870438 1.080342 0.478967
C  -2.071041 -0.246229 0.876916
C  -1.010424 -0.293664 -0.239435
C  -3.392935 -0.875398 0.369834
C  -3.860023 -0.242305 -0.960772
C  -2.711155 -0.239305 -1.98132
C  1.503512 -0.2499 -0.263276
C  0.543543 1.455492 0.849392
C  2.471332 0.64049 0.265651
C  3.836474 0.309687 0.020984
C  3.083581 -1.59413 -1.150332
H  -2.276716 0.816409 1.141859
H  -0.813476 -1.342098 -0.546598
H  -3.246889 -1.965073 0.252156
H  -4.74191 -0.780029 -1.347863
H  -2.428303 -1.273974 -2.265859
H  -2.980453 0.331631 -2.883656
H  -0.239412 2.075987 1.276817
H  -2.337562 -1.117132 2.644328
H  -4.826189 0.170351 1.269678
H  -3.553443 1.73917 -0.736869
H  3.363649 -2.48727 -1.716477
H  5.825997 0.792874 0.278267
H  4.676945 1.92012 1.020252
