program: Gaussian 09
title: 000023548
version: EM64L-G09RevD.01
frameworkgroup: C1[X(C9H11NO3)]
method: RPBEPBE
basis: SDD
operation: Freq
keyword: #p
keyword: freq=noraman
keyword: PBEPBE/SDD
title: #p freq=noraman PBEPBE/SDD
converged: YES YES YES YES
title: Mulliken charges:
elementType: O O O N C C C C C C C C C H H H H H H H H H H H
charge: -0.313352 -0.443057 -0.271180 -0.464441 0.523813 -0.579118 -0.395151 0.348582 -0.166438 -0.428035 -0.214203 0.262286 -0.673409 0.248957 0.301186 0.332216 0.225283 0.221460 0.228755 0.228758 0.212802 0.229465 0.229464 0.355357
chargesum: 0.00000
title: Mulliken charges with hydrogens summed into heavy atoms:
elementType: O O O N C C C C C C C C C
charge: -0.313352 -0.087701 -0.271180 -0.132225 0.523813 -0.330161 -0.093965 0.348582 0.058845 -0.206575 0.243310 0.262286 -0.001677
polarizability: 1.88539151e+02 -1.23957239e+00 1.15799644e+02 -9.87584152e-04 2.46396216e-03 5.67783104e+01
1716.lowfreq: -35.7460 0.0008 0.0011 0.0013 3.4733 8.2667 23.2947 54.0400 69.2807
frequency: -27.9959 54.0397 69.2775 87.1305 127.2576 202.6078 227.4131 245.1912 255.1971 261.4508 319.1671 354.0753 380.2942 428.6992 454.0584 515.4091 594.2588 605.1071 649.3927 687.5833 699.4592 702.6516 752.4573 774.6061 798.1501 863.4714 864.2473 880.7691 907.1994 976.6648 980.3732 1000.8445 1047.0122 1092.5463 1111.4736 1139.6032 1140.7093 1157.6271 1177.6078 1209.4154 1248.4617 1281.7762 1318.9473 1355.1559 1392.8958 1398.4461 1449.3859 1462.9391 1476.3353 1486.3469 1489.7853 1531.8617 1602.5627 1635.9491 1665.9498 2995.6529 3008.2073 3066.0902 3092.8758 3106.6601 3123.0433 3146.4175 3151.8396 3197.9442 3544.5375 3588.0743
redmass: 2.2324 3.9812 6.2383 4.2486 3.3920 4.6896 4.6886 1.5037 2.4414 6.3978 6.8377 1.1064 3.7983 3.9279 2.9551 7.2012 2.9412 6.6430 1.5681 2.0380 7.1885 5.1530 5.6150 1.4049 1.0940 1.6837 3.7844 1.4066 4.8712 1.2983 5.7728 2.9765 3.5480 1.6047 2.2243 1.4671 1.4004 2.8317 1.1312 1.5033 1.1298 2.2570 1.6782 1.3482 4.3373 1.3917 2.4309 1.0408 1.0560 2.7053 1.1012 2.4102 5.4541 6.2544 8.6345 1.0356 1.0579 1.1068 1.0985 1.1026 1.0884 1.0925 1.0948 1.0950 1.0761 1.0660
irintensity: 0.0000 0.2221 7.0548 1.4121 2.0253 10.5920 1.5727 1.0470 8.4030 1.9864 8.1286 145.9081 8.9060 6.9642 5.9148 1.5990 4.4245 3.6870 44.9218 36.3426 8.6892 48.9584 8.0586 52.3760 3.8459 50.4095 10.2805 16.3698 127.7189 4.2546 5.1032 22.5375 230.9506 23.2271 19.0690 4.8748 169.7715 453.6296 43.9343 22.0164 0.0234 88.7592 40.8679 19.9473 130.3317 10.9082 90.5443 12.0557 9.5334 118.3795 18.7247 340.6982 99.8605 245.6239 200.0155 22.7482 25.1567 9.3207 31.6905 46.9293 12.0143 10.8566 12.1187 6.0760 30.5035 39.7589
temp: 298.150 k
press: 1.00000 atm
elementType: 8 8 8 7 6 6 6 6 6 6 6 6 6 1 1 1 1 1 1 1 1 1 1 1
symmnumber: 1
zpe: 494133.3 jmol-1
zpe.correction: 0.188205 hartree
zpe.thermalcorrener: 0.200144 hartree
zpe.thermalcorrenthalpy: 0.201088 hartree
zpe.thermalcorrgfe: 0.149702 hartree
zpe.sumelectzpe: -629.026856 hartree
zpe.sumelectthermal: -629.014917 hartree
zpe.sumelectthermalent: -629.013973 hartree
zpe.sumelectthermalfe: -629.065360 hartree
dipole: 0.1747 -1.0488 0.0001
dipole: 1.0632
quadrupole: -49.2086 -79.0106 -79.6411
quadrupole: 6.6771 -0.0004 0.0001
quadrupole: 20.0782 -9.7239 -10.3543 6.6771 -0.0004 0.0001
hfenergy: -629.2150615 hartree
pointgroup: C01 [X(C9H11N1O3)]
dipole: 0.0714645 0.412163 -0.0000244 debye
dipolederiv: -2.1171422 0.2667326 -0.0001046 0.608824 -0.5793008 -0.000002 -0.000261 0.0000365 -0.314828 -0.8782954 -0.6326255 -0.0000118 -0.7828495 -0.715602 0.0000065 -0.0000096 0.0000098 -0.4317296 -0.8111871 -0.0397574 -0.0000151 -0.2328815 -0.939513 0.0000497 -0.0000996 -0.0001234 -0.3375243 -2.1566213 -0.0732737 -0.0000624 -0.3537999 -0.3732185 -0.0000278 -0.000033 -0.0000065 -0.3323624 1.5089302 -0.0620429 -0.0000137 -0.5048548 0.2856207 0.0000083 -0.0000569 0.000014 0.1188211 -0.6396092 -0.1821819 -0.0000068 -0.0962531 -0.0445822 0.0000131 0.000031 0.0000105 -0.2457425 -0.4328093 0.0563907 -0.0000008 0.318135 -0.2264867 -0.0000055 0.0000218 0.0000029 -0.2139237 1.0239954 0.526539 -0.0000018 0.6962382 0.7338701 0.0000052 -0.0000125 0.0000015 0.1037753 0.3486226 -0.0197343 -0.0000096 0.0351538 0.1819843 0.0000088 -0.0000199 0.0000145 -0.1093016 -0.2340701 -0.0051967 -0.0000071 -0.3189209 -0.3614616 0.0000039 -0.0000129 -0.0000024 -0.2519075 1.1655256 -0.0407323 0.0000845 0.2165679 0.2376713 0.0000207 0.0001081 -0.0000034 0.3590149 2.8337533 -0.0184918 0.0001069 0.2241643 1.364675 -0.0000402 0.0003047 0.0000824 0.3077036 -0.1161974 0.0893417 0.0000014 0.0560376 -0.0017737 -0.0000127 -0.0000082 -0.0000115 0.0646431 0.0735711 0.0700896 0.0000073 0.0599329 -0.046231 -0.0000102 0.0000096 -0.0000105 0.1866775 0.1407551 -0.0600414 0.0000043 -0.0505364 0.0732851 -0.0000042 0.0000118 -0.0000064 0.1906007 0.1868564 -0.0369853 0.0000096 0.00447 0.1556434 -0.0000039 0.0000208 -0.0000035 0.3250443 0.0621766 0.0470848 0.0000031 0.0648305 -0.1002855 -0.0000103 0.000004 -0.0000113 0.1502041 -0.1451778 0.027075 0.0000101 0.0065122 0.0778132 -0.0000041 0.0000139 -0.0000053 0.1863306 -0.0622017 0.0252672 0.0164408 -0.0767263 -0.0020581 -0.0927214 -0.0246932 -0.1039454 -0.0637215 -0.0621545 0.0252463 -0.0164295 -0.0767645 -0.0021293 0.0927222 0.0246695 0.1039616 -0.0636231 -0.1609127 -0.0622313 -0.0000434 -0.0886133 0.0428044 -0.0000251 -0.0000534 -0.0000218 0.1161699 0.1175938 -0.0219738 -0.036545 0.0376024 0.0040566 -0.104075 -0.0057728 -0.1180231 -0.0650753 0.1175803 -0.0220167 0.0365752 0.0375795 0.0039617 0.1041126 0.0058301 0.1180493 -0.06497 0.2370182 0.1435181 0.0000085 0.2161518 0.2312566 -0.0000085 0.0000076 -0.0000084 0.3857241 unknown
polarizability: 188.5523613|0.7586013|115.7864337|0.0010039|0.0024574|56.7783104 unknown
InChI: InChI=1S/C9H11NO3/c1-2-13-9(12)10-7-4-3-5-8(11)6-7/h3-6,10-11H,2H2,1H3
charge 0 multiplicity 1
24 atoms
O  -2.877657 0.558942 0.000136
O  4.020949 1.71206 0.000155
O  -1.858288 -1.566556 0.000044
N  -0.623801 0.464434 0.000264
C  0.727759 0.025523 0.000199
C  1.728205 1.029662 0.000203
C  1.089979 -1.349241 0.000134
C  3.087106 0.658945 0.000148
C  2.458286 -1.68891 0.000082
C  3.470355 -0.703928 0.000089
C  -4.209515 -0.109488 -0.000156
C  -1.770757 -0.313598 0.00027
C  -5.256283 0.999846 -0.000037
H  1.473179 2.094979 0.000249
H  0.313837 -2.115788 0.000128
H  -0.790746 1.472978 0.000315
H  2.742355 -2.746943 0.000034
H  4.529594 -0.989578 0.000046
H  -4.277938 -0.75413 -0.895196
H  -4.278137 -0.754514 0.894591
H  -6.268678 0.556598 -0.000246
H  -5.156623 1.636816 0.895443
H  -5.156425 1.637205 -0.895221
H  4.944343 1.357883 0.000124
