program: Gaussian 09
title: 000259841
version: EM64L-G09RevD.01
frameworkgroup: C1[X(C14H20N2)]
method: RPBEPBE
basis: SDD
operation: Freq
keyword: #pfreq=noraman
keyword: PBEPBE/SDD
title: #p freq=noraman PBEPBE/SDD
converged: NO YES NO YES
title: Mulliken charges:
elementType: N N C C C C C C C C C C C C C C H H H H H H H H H H H H H H H H H H H H
charge: -0.010455 -0.010453 0.343209 0.343205 -0.493817 -0.493808 -0.493816 -0.493807 -0.425972 -0.425969 -0.425972 -0.425969 -0.386539 -0.386539 -0.313677 -0.313677 0.226089 0.239633 0.239639 0.226081 0.226089 0.239633 0.239640 0.226080 0.227969 0.206843 0.206843 0.227968 0.227970 0.206843 0.206843 0.227969 0.196204 0.209757 0.196205 0.209757
chargesum: 0.00000
title: Mulliken charges with hydrogens summed into heavy atoms:
elementType: N N C C C C C C C C C C C C C C
charge: -0.010455 -0.010453 0.343209 0.343205 -0.028095 -0.028088 -0.028094 -0.028088 0.008841 0.008843 0.008840 0.008843 0.019423 0.019423 -0.313677 -0.313677
polarizability: 1.63169748e+02 -4.17070600e-01 1.51570695e+02 1.96377334e-04 -4.34899165e-04 1.27722432e+02
1716.lowfreq: -15.3478 -11.3915 -0.0001 0.0005 0.0008 4.3784 54.6460 70.3992 98.4366
frequency: 54.6460 70.3992 98.3837 123.5000 130.0953 137.0934 162.9070 164.9640 236.6021 239.6662 258.2775 269.9473 319.7775 328.9705 372.1627 390.6956 395.4709 421.4104 429.8135 478.3749 497.1157 506.5224 567.6364 576.4077 626.0239 644.9000 782.0439 783.7386 784.3926 816.8923 830.9638 846.2110 864.7790 904.7667 917.9974 925.6012 933.5064 935.8259 938.6214 972.9695 1003.6200 1050.2218 1050.5444 1053.4752 1068.8956 1069.9021 1104.0577 1104.6504 1136.2646 1144.0315 1147.7420 1180.1443 1180.9503 1212.3295 1257.5198 1262.5988 1270.1945 1277.2239 1278.5028 1292.3362 1311.8484 1326.3639 1337.6925 1340.4768 1341.4269 1342.0967 1345.6907 1351.7321 1355.4892 1366.7451 1455.5156 1461.0802 1461.7556 1462.9806 1463.8726 1463.8789 1470.6393 1473.2259 1476.8287 1478.0979 2170.3360 2174.3155 2970.8874 2970.9727 2979.9898 2980.1455 2980.2058 2980.7395 2982.6521 2984.6250 2986.0617 2987.6407 3037.0939 3037.4658 3037.5576 3038.3915 3046.0666 3047.6085 3053.6450 3058.8808 3063.8826 3066.5407
redmass: 4.6912 3.2082 4.7329 9.5086 3.1841 3.9001 4.3556 3.6391 1.9558 1.9853 4.6045 2.1885 2.0216 4.5723 1.7893 2.3963 5.9239 3.1942 3.2539 3.6710 1.9188 2.3986 5.2825 4.8384 3.2891 3.4714 1.4667 1.5197 3.9036 2.1917 1.7628 2.4054 1.9718 2.9201 1.9881 2.2274 1.3860 1.5131 2.7868 1.9181 2.6555 1.9491 3.6332 1.8264 2.2996 1.6531 1.6101 1.5645 1.5656 1.6550 2.5671 2.5371 1.3508 1.9755 1.3003 1.2875 1.2263 1.4727 1.1782 1.5667 1.3033 1.2585 1.3526 1.3754 1.3773 1.3363 1.4789 1.4922 1.4515 1.4114 1.0833 1.0873 1.0816 1.0877 1.0836 1.0839 1.0780 1.0789 1.0928 1.0917 12.6356 12.6456 1.0645 1.0644 1.0612 1.0624 1.0621 1.0627 1.0621 1.0619 1.0623 1.0634 1.0954 1.0952 1.0997 1.1000 1.1016 1.1019 1.1025 1.1027 1.0988 1.0998
irintensity: 4.5872 1.2278 0.0000 10.3717 1.7498 0.0000 3.1215 0.0000 0.0000 0.0081 0.0000 1.3980 0.0000 0.0000 0.3676 0.0000 0.5876 0.0000 0.2414 0.0000 2.9935 0.0000 0.0881 0.0000 1.6862 0.0000 0.0000 0.7823 5.5624 0.0037 0.0000 0.0000 18.1524 4.4719 0.0000 0.9397 19.7064 0.0000 0.0000 0.0000 13.0227 0.0524 0.0000 0.1783 0.0000 0.0000 0.1125 0.0000 0.0000 1.1945 10.6724 0.0000 0.6601 0.0000 4.9448 0.0000 0.0000 2.2425 4.4511 0.0000 0.0000 1.0191 0.0000 1.8095 0.0000 17.5169 0.0000 1.9133 0.2930 0.0000 6.3028 0.0000 0.0000 17.1235 0.0851 18.3012 0.0000 42.4463 0.0000 2.9405 0.0000 15.1703 61.4475 0.0011 0.0022 67.1261 48.0412 0.0004 0.0001 4.3705 38.0510 0.0000 116.1095 0.0001 0.0005 85.5793 54.2582 0.0000 0.0000 89.2690 43.4486 0.0000
temp: 298.150 k
press: 1.00000 atm
elementType: 7 7 6 6 6 6 6 6 6 6 6 6 6 6 6 6 1 1 1 1 1 1 1 1 1 1 1 1 1 1 1 1 1 1 1 1
symmnumber: 1
zpe: 817099.8 jmol-1
zpe.correction: 0.311217 hartree
zpe.thermalcorrener: 0.326693 hartree
zpe.thermalcorrenthalpy: 0.327637 hartree
zpe.thermalcorrgfe: 0.269628 hartree
zpe.sumelectzpe: -653.751396 hartree
zpe.sumelectthermal: -653.735920 hartree
zpe.sumelectthermalent: -653.734975 hartree
zpe.sumelectthermalfe: -653.792985 hartree
dipole: 0.0001 0.0000 0.0004
dipole: 0.0004
quadrupole: -89.1684 -122.4659 -92.6855
quadrupole: 8.4620 -0.0001 0.0006
quadrupole: 12.2715 -21.0260 8.7544 8.4620 -0.0001 0.0006
hfenergy: -654.0626126 hartree
pointgroup: C01 [X(C14H20N2)]
dipole: 0.0000426 0.0000011 0.0001643 debye
polarizability: 163.1772482|-0.2947892|151.5631951|0.0002009|-0.0004328|127.7224318 unknown
InChI: InChI=1S/C14H20N2/c15-11-13(7-3-1-4-8-13)14(12-16)9-5-2-6-10-14/h1-10H2
charge 0 multiplicity 1
36 atoms
N  0.966567 -2.871176 -0.000099
N  -0.966633 2.871176 -0.000213
C  0.780057 -0.200898 -0.000008
C  -0.780036 0.200902 -0.000024
C  1.51006 0.345693 1.276888
C  1.510094 0.34578 -1.276844
C  -1.510054 -0.345646 1.276882
C  -1.510056 -0.345823 -1.27685
C  3.030682 0.067363 1.268685
C  3.030714 0.067447 -1.268619
C  -3.030676 -0.067318 1.26865
C  -3.030677 -0.067495 -1.268654
C  3.706638 0.631885 0.000061
C  -3.706616 -0.631888 0.000038
C  0.867143 -1.681133 -0.00006
C  -0.867127 1.68114 -0.000129
H  1.061124 -0.090699 2.186579
H  1.33589 1.439584 1.311441
H  1.335923 1.439675 -1.31132
H  1.061177 -0.090547 -2.186575
H  -1.061129 0.090778 2.186563
H  -1.335883 -1.439536 1.311473
H  -1.33588 -1.439718 -1.311285
H  -1.06113 0.090474 -2.186592
H  3.208957 -1.025031 1.327443
H  3.479422 0.512855 2.17693
H  3.479479 0.512998 -2.176824
H  3.208989 -1.024943 -1.327445
H  -3.208953 1.025078 1.327367
H  -3.479427 -0.512778 2.176907
H  -3.479429 -0.513081 -2.176848
H  -3.208955 1.024892 -1.327523
H  3.628255 1.738687 0.000096
H  4.785045 0.385022 0.000067
H  -3.628231 -1.73869 0.000115
H  -4.785023 -0.385026 0.000023
