program: Gaussian 09
title: 000259842
version: EM64L-G09RevD.01
frameworkgroup: C1[X(C15H9Cl2NO)]
method: RPBEPBE
basis: SDD
operation: Freq
keyword: #p
keyword: freq=noraman
keyword: PBEPBE/SDD
title: #p freq=noraman PBEPBE/SDD
converged: YES YES NO NO
title: Mulliken charges:
elementType: Cl Cl O N C C C C C C C C C C C C C C C H H H H H H H H H
charge: 0.010858 -0.036000 -0.295216 -0.036282 0.303604 0.465635 0.059573 0.307453 -0.433030 -0.306783 -0.333652 -0.357679 -0.371354 -0.213968 -0.220046 -0.101907 -0.234406 -0.226829 -0.238514 0.263089 0.268934 0.229989 0.253911 0.283932 0.261691 0.231641 0.231133 0.234223
chargesum: 0.00000
title: Mulliken charges with hydrogens summed into heavy atoms:
elementType: Cl Cl O N C C C C C C C C C C C C C C C
charge: 0.010858 -0.036000 -0.295216 -0.036282 0.303604 0.465635 0.059573 0.307453 -0.169941 -0.306783 -0.064718 -0.127690 -0.117443 0.069964 0.041645 -0.101907 -0.002766 0.004304 -0.004291
polarizability: 3.91090536e+02 -4.15598744e+00 2.13228799e+02 8.10644960e-02 -1.82865224e-01 7.01680348e+01
1716.lowfreq: -4.2219 -0.0022 -0.0021 0.0008 1.5495 6.2825 10.8869 30.2615 55.1214
frequency: 10.8477 30.2319 55.1214 60.6754 97.2653 140.2430 162.3178 171.5719 173.8116 222.7202 272.5603 287.8940 356.1668 358.1579 379.9084 399.9546 424.5636 450.4929 492.6528 520.6765 536.2209 550.8179 615.0875 656.3117 657.6244 676.8243 679.3787 695.1298 731.4729 768.6520 775.9019 829.1229 840.2772 853.3961 868.8025 869.9881 919.4842 927.1616 966.3357 972.4888 981.4457 988.0145 1000.1252 1010.1657 1038.1953 1048.8548 1083.6480 1089.6896 1111.4889 1150.2820 1175.9173 1193.5550 1228.5720 1257.8171 1260.3727 1284.3538 1327.6383 1352.7498 1379.3011 1382.8905 1438.6568 1446.0186 1469.2754 1535.2710 1555.4187 1560.1435 1586.0538 1595.7731 1618.3284 3130.3330 3137.6485 3149.9927 3161.7591 3168.1815 3172.8701 3183.7724 3187.6202 3245.3820
redmass: 5.8972 4.8740 7.4581 6.6008 6.5472 8.3680 5.7690 13.5254 6.8380 9.1014 5.8085 10.9194 5.8597 8.9986 9.9199 2.8092 5.9524 3.3994 3.5586 7.7115 6.8463 4.8343 6.4685 7.3857 3.2196 6.2340 6.7066 1.8839 4.1723 9.2629 1.7954 1.4504 1.4402 1.2776 12.0834 1.4207 8.0570 1.4397 1.3562 9.0527 1.3860 6.2460 1.3263 5.4579 2.4244 2.8579 1.6279 3.5233 2.2963 1.3549 1.0558 1.1323 4.3383 1.6972 2.0314 2.1622 1.4000 3.8138 6.0450 7.3708 2.3983 2.5849 2.2949 8.5921 8.3654 6.2478 6.2915 7.1756 6.0663 1.0850 1.0882 1.0933 1.0962 1.0886 1.1008 1.0935 1.0970 1.0984
irintensity: 0.0048 0.0211 0.0739 0.0265 0.5374 0.2585 0.2827 0.4496 1.0620 0.3526 0.4477 2.0806 1.9834 5.2359 4.2515 0.0129 1.3740 7.5715 8.2760 25.9080 2.2729 1.8093 0.0208 3.4672 6.7471 11.7622 10.3280 45.2400 3.8242 51.4858 63.9558 41.6904 24.4107 3.5372 5.3762 18.1343 13.9358 5.2031 0.6892 44.5166 0.0226 0.7074 0.2057 1.7066 16.7061 8.3261 5.0501 50.2346 16.3735 7.3313 0.1484 1.1890 2.6645 3.9442 2.1284 4.9142 0.0291 15.5194 6.7961 0.1145 1.9217 135.2262 59.6973 10.2113 43.2824 3.3752 1.5046 51.6445 1.7850 3.5092 1.2133 21.8110 28.5966 0.6696 17.7655 0.1478 1.4563 11.4806
temp: 298.150 k
press: 1.00000 atm
elementType: 17 17 8 7 6 6 6 6 6 6 6 6 6 6 6 6 6 6 6 1 1 1 1 1 1 1 1 1
symmnumber: 1
zpe: 515266.8 jmol-1
zpe.correction: 0.196255 hartree
zpe.thermalcorrener: 0.211917 hartree
zpe.thermalcorrenthalpy: 0.212861 hartree
zpe.thermalcorrgfe: 0.149801 hartree
zpe.sumelectzpe: -1625.780872 hartree
zpe.sumelectthermal: -1625.765209 hartree
zpe.sumelectthermalent: -1625.764265 hartree
zpe.sumelectthermalfe: -1625.827325 hartree
dipole: -3.4625 -2.0331 -0.0018
dipole: 4.0153
quadrupole: -107.5547 -117.4243 -128.6126
quadrupole: -0.2762 0.0294 -0.0345
quadrupole: 10.3092 0.4395 -10.7487 -0.2762 0.0294 -0.0345
hfenergy: -1625.9771264 hartree
pointgroup: C01 [X(C15H9Cl2N1O1)]
dipole: -1.3685768 -0.7886435 -0.0236677 debye
polarizability: 390.9968378|-5.6195862|213.2711493|2.1363793|2.2744149|70.2193826 unknown
InChI: InChI=1S/C15H9Cl2NO/c16-11-6-7-12(13(17)8-11)15-18-9-14(19-15)10-4-2-1-3-5-10/h1-9H
charge 0 multiplicity 1
28 atoms
Cl 3.1634 2.789132 0.107986
Cl 6.096072 -1.856362 0.033833
O  -0.499298 -0.122708 0.020259
N  0.162506 2.070932 0.054094
C  -1.666928 0.679156 0.023087
C  1.929578 0.225033 0.040542
C  0.591751 0.806993 0.040191
C  -2.966541 0.017701 0.006172
C  -1.238307 2.004619 0.04369
C  3.139364 0.978294 0.068006
C  2.053813 -1.198614 0.011238
C  -4.160213 0.794401 0.00405
C  -3.066962 -1.401711 -0.008169
C  4.402786 0.35227 0.066207
C  3.301712 -1.843099 0.008888
C  4.467251 -1.051458 0.036476
C  -5.419786 0.164829 -0.011797
C  -4.330868 -2.025639 -0.024132
C  -5.512594 -1.247866 -0.026014
H  -1.835921 2.911768 0.051993
H  1.138616 -1.795378 -0.010221
H  -4.101112 1.888357 0.014567
H  -2.152563 -2.002902 -0.006392
H  5.312254 0.957091 0.087767
H  3.368098 -2.933808 -0.013952
H  -6.33028 0.773787 -0.013273
H  -4.395549 -3.119083 -0.034975
H  -6.49348 -1.735037 -0.038422
