program: Gaussian 09
title: 000259890
version: EM64L-G09RevD.01
frameworkgroup: C1[X(C20H28O3)]
method: RPBEPBE
basis: SDD
operation: Freq
keyword: #pfreq=noraman
keyword: PBEPBE/SDD
title: #p freq=noraman PBEPBE/SDD
converged: YES YES NO NO
title: Mulliken charges:
elementType: O O O C C C C C C C C C C C C C C C C C C C C H H H H H H H H H H H H H H H H H H H H H H H H H H H H
charge: -0.466939 -0.475756 -0.268681 0.459904 -0.125849 -0.107016 -0.270728 -0.739312 0.332614 -0.169740 -0.534661 -0.482481 -0.510707 -0.831507 0.257198 -0.581443 -0.773317 0.299986 -0.373868 -0.548512 -0.415766 0.318537 -0.535878 0.224369 0.234675 0.204063 0.238139 0.240181 0.210140 0.253011 0.201083 0.219370 0.192112 0.214480 0.215447 0.233750 0.219264 0.222892 0.221921 0.226936 0.235865 0.211469 0.229328 0.354023 0.348811 0.220780 0.253785 0.238012 0.242408 0.218867 0.218740
chargesum: 0.00000
title: Mulliken charges with hydrogens summed into heavy atoms:
elementType: O O O C C C C C C C C C C C C C C C C C C C C
charge: -0.112916 -0.126945 -0.268681 0.459904 0.098520 0.127659 -0.066664 -0.260993 0.332614 0.040400 -0.080567 -0.070999 -0.080780 -0.155600 0.257198 -0.132586 -0.096656 0.299986 -0.153088 -0.294727 -0.177754 0.318537 0.144138
polarizability: 3.01283076e+02 -7.14236303e+00 2.05398383e+02 1.10434668e+00 2.66906476e+00 1.54857685e+02
1716.lowfreq: -10.7048 -0.0002 0.0004 0.0009 5.4598 11.8630 25.3013 52.0175 64.7876
frequency: 25.2310 51.9924 64.5385 74.7395 94.8250 100.6166 121.8488 156.2020 170.3780 183.1112 209.6573 218.3934 222.9415 228.8818 236.2508 250.1832 260.1865 289.1694 304.3205 313.4143 335.0971 351.7169 362.0617 367.4686 397.2327 411.1979 423.6653 441.5122 449.3040 482.2012 484.9369 499.0411 517.9312 543.1667 556.9236 571.5760 599.2114 626.6992 637.0177 649.4307 710.0045 714.4702 741.5054 772.1157 785.7973 812.7310 826.9383 843.5397 849.2417 863.5353 885.9473 893.9045 912.1801 915.7725 928.5333 933.2925 940.8259 970.0334 983.3153 1003.6500 1006.9398 1018.6379 1036.3407 1045.6911 1062.4848 1076.5405 1081.6325 1106.2789 1110.9460 1116.2443 1127.0348 1133.3221 1143.5642 1150.6588 1154.4115 1172.7844 1180.1544 1181.8270 1186.2297 1198.6758 1204.2351 1215.7027 1235.9664 1245.2370 1251.9301 1262.2989 1274.2436 1280.0325 1290.0983 1295.9679 1306.5065 1316.9763 1326.2536 1329.7088 1334.3801 1338.2111 1346.0275 1356.7987 1372.9209 1373.9629 1385.2734 1387.3557 1393.8400 1422.2700 1436.4927 1454.6229 1457.8995 1461.6059 1465.0868 1468.1880 1471.7706 1472.9032 1473.3911 1475.2251 1487.8020 1493.7916 1495.1033 1576.3025 1624.5380 2901.2304 2911.5942 2951.9426 2955.2391 2957.5763 2958.0442 2968.4367 2976.4190 2983.3491 2987.5162 2987.7875 2992.3186 3018.9735 3031.0165 3032.7282 3040.9328 3042.8429 3052.6087 3068.9772 3086.6200 3089.1508 3090.3082 3121.0528 3136.4154 3138.6193 3163.3089 3409.7496 3563.0223
redmass: 4.0664 3.6518 3.9073 3.5734 2.6315 4.0272 1.3905 2.3917 3.9996 3.2860 2.4424 1.6284 1.3091 1.1779 2.8869 1.7475 2.4850 2.5708 2.7031 2.8764 3.5428 2.8751 3.3860 3.4318 3.6790 3.1830 3.0733 2.8420 3.5205 2.8953 2.8792 3.8658 3.1016 4.3517 3.2076 2.6351 3.8997 2.2896 2.0347 1.7516 4.7992 3.4107 2.9076 3.1012 2.6426 1.7402 2.0088 2.1175 2.4929 2.3796 3.0297 1.6388 1.9164 1.9456 1.6295 1.4611 1.8345 1.7753 2.2109 3.7230 2.2690 2.2239 2.1080 3.0272 2.2417 1.6544 2.3808 2.3399 1.2659 1.7328 1.8382 1.9803 1.6324 1.7444 1.8016 1.4945 1.8495 1.4253 1.9305 1.5758 1.8426 1.8775 1.4665 1.8913 2.4149 1.4601 1.3817 1.4460 1.4873 1.3198 1.4541 1.4614 1.4306 1.4445 1.4380 1.4396 1.4249 1.5247 1.6180 4.5790 1.4591 1.2667 1.2720 3.1305 1.2538 1.1268 1.0617 1.0646 1.0507 1.0782 1.0725 1.0827 1.0734 1.0788 1.0632 2.5037 1.0585 7.1431 6.8200 1.0798 1.0798 1.0808 1.0331 1.0833 1.0669 1.0651 1.0606 1.0449 1.0580 1.0391 1.0550 1.0938 1.1001 1.1014 1.1037 1.1026 1.1001 1.0975 1.0985 1.0988 1.0989 1.0991 1.0902 1.0876 1.0949 1.0637 1.0660
irintensity: 0.4031 1.6721 7.8788 4.1109 23.4603 1.7415 150.8765 1.8657 8.6716 0.4770 2.8713 3.7380 1.7199 0.1618 3.9712 0.7134 2.1730 1.5748 1.3550 2.7678 3.2956 0.4083 2.2705 6.7189 2.7197 0.6138 1.0325 3.5675 6.4842 4.5825 2.7453 1.3689 0.1128 10.5447 7.2905 2.6801 1.7758 14.2726 24.4202 29.9657 3.3621 3.1598 5.9022 27.1930 1.8696 22.3398 3.0949 11.0918 2.7871 0.8988 5.8234 34.6749 2.0237 8.0283 3.6679 1.9710 4.3050 14.4256 3.1324 57.3064 31.1860 21.4354 28.6799 32.7719 14.9898 13.1290 2.6166 9.4571 0.1643 4.6347 12.1507 19.2780 19.4208 34.9108 7.7231 16.2981 27.4049 30.6998 13.6770 12.6232 15.0488 11.3292 7.4954 70.8147 57.6703 1.9076 15.5316 8.8166 3.5232 3.5117 28.0359 12.2429 6.2376 3.0182 1.1421 8.9861 10.5537 1.8365 54.4426 14.2810 2.9961 7.7388 31.4084 25.8517 2.0089 10.8248 1.8599 4.8698 12.5711 17.5643 2.4303 3.1869 11.6862 54.6062 5.4412 110.5336 8.3724 25.1783 71.0160 12.1023 13.0172 8.2282 80.1682 59.7571 24.9453 46.3660 28.0350 14.4758 72.8484 10.2499 31.7488 36.0568 15.6268 69.7506 52.1408 22.3166 47.0566 31.0833 59.7849 10.5629 23.7250 30.6369 16.4800 3.2737 19.0143 51.5793 6.6949
temp: 298.150 k
press: 1.00000 atm
elementType: 8 8 8 6 6 6 6 6 6 6 6 6 6 6 6 6 6 6 6 6 6 6 6 1 1 1 1 1 1 1 1 1 1 1 1 1 1 1 1 1 1 1 1 1 1 1 1 1 1 1 1
symmnumber: 1
zpe: 1150452.9 jmol-1
zpe.correction: 0.438184 hartree
zpe.thermalcorrener: 0.460188 hartree
zpe.thermalcorrenthalpy: 0.461133 hartree
zpe.thermalcorrgfe: 0.388798 hartree
zpe.sumelectzpe: -1002.831194 hartree
zpe.sumelectthermal: -1002.809190 hartree
zpe.sumelectthermalent: -1002.808246 hartree
zpe.sumelectthermalfe: -1002.880580 hartree
dipole: 1.1416 0.5463 0.8424
dipole: 1.5203
quadrupole: -137.0586 -136.8499 -138.7336
quadrupole: -15.1668 -5.6011 -2.9479
quadrupole: 0.4887 0.6975 -1.1862 -15.1668 -5.6011 -2.9479
hfenergy: -1003.2693784 hartree
pointgroup: C01 [X(C20H28O3)]
dipole: 0.4507386 0.2262808 0.321549 debye
polarizability: 301.3715818|-6.5572914|205.4280217|-0.0163339|1.3746369|154.7395392 unknown
InChI: InChI=1S/C20H28O3/c1-19-9-8-15-14-7-5-13(23-3)10-12(14)4-6-16(15)17(19)11-20(2,22)18(19)21/h5,7,10,15-18,21-22H,4,6,8-9,11H2,1-3H3
charge 0 multiplicity 1
51 atoms
O  -4.114753 -1.589647 -1.247443
O  -5.032867 0.836185 -1.238695
O  6.053181 0.52106 0.11224
C  -2.457682 -1.018499 0.506813
C  -1.954231 0.30701 -0.153981
C  -0.476134 0.60797 0.144534
C  -3.959895 -1.0112 0.08561
C  -3.046396 1.332889 0.224673
C  -4.383015 0.536602 0.077446
C  0.381554 -0.573102 -0.408667
C  -1.614328 -2.192348 -0.043753
C  -0.09414 -1.943274 0.158346
C  0.025557 1.932841 -0.468916
C  -2.391781 -1.001372 2.058936
C  1.885835 -0.308438 -0.229124
C  1.461155 2.232169 0.008861
C  -5.450066 0.872159 1.121518
C  2.389453 1.021256 -0.073012
C  2.825041 -1.367549 -0.268838
C  3.779685 1.238131 0.035546
C  4.217341 -1.157545 -0.15919
C  4.696737 0.164529 -0.00511
C  7.037714 -0.560384 0.065512
H  -2.02796 0.132618 -1.253442
H  -0.328822 0.671133 1.24499
H  -4.596735 -1.572725 0.801046
H  -2.91696 1.676774 1.268024
H  -3.05467 2.240496 -0.40824
H  0.179981 -0.600623 -1.506047
H  -1.840411 -2.309718 -1.119584
H  -1.900864 -3.142769 0.448385
H  0.175332 -2.002423 1.231785
H  0.451561 -2.765599 -0.341792
H  -0.639345 2.771416 -0.185752
H  -0.001319 1.854223 -1.575705
H  -1.356116 -0.929732 2.430615
H  -2.960484 -0.165851 2.505058
H  -2.820999 -1.941126 2.454264
H  1.421185 2.574559 1.064326
H  1.895482 3.070898 -0.568473
H  -6.393265 0.348362 0.885341
H  -5.125027 0.560139 2.130033
H  -5.653341 1.957316 1.136083
H  -4.833812 -1.05255 -1.687711
H  -4.336856 1.141896 -1.874591
H  2.471357 -2.39645 -0.391171
H  4.17594 2.253303 0.152792
H  4.898729 -2.012592 -0.197726
H  8.014404 -0.065977 0.174802
H  7.000044 -1.100821 -0.900902
H  6.889501 -1.279322 0.895389
