program: Gaussian 09
title: 000259819
version: EM64L-G09RevD.01
frameworkgroup: C1[X(C7H5N3O2)]
method: RPBEPBE
basis: SDD
operation: Freq
keyword: #pfreq=noraman
keyword: PBEPBE/SDD
title: #p freq=noraman PBEPBE/SDD
converged: NO YES NO YES
title: Mulliken charges:
elementType: O O N N N C C C C C C C H H H H H
charge: -0.209438 -0.248197 -0.253962 -0.064848 0.033256 0.214075 0.360170 -0.201912 -0.267737 -0.359751 -0.211864 -0.166217 0.317985 0.293623 0.269236 0.243714 0.251868
chargesum: 0.00000
title: Mulliken charges with hydrogens summed into heavy atoms:
elementType: O O N N N C C C C C C C
charge: -0.209438 -0.248197 -0.253962 -0.064848 0.033256 0.214075 0.360170 0.116074 0.001499 -0.066128 0.031850 0.085650
polarizability: 1.73089084e+02 7.94651004e+00 1.17758937e+02 -8.97478884e-03 4.77363566e-03 3.86359451e+01
1716.lowfreq: -7.6435 -4.6267 -0.0007 -0.0003 -0.0001 4.6996 79.0393 118.0133 194.6227
frequency: 79.0338 118.0100 194.6200 223.5905 276.5970 352.4662 404.6156 430.0503 515.6732 563.9186 595.2083 606.3460 628.9115 684.7151 740.8742 752.6652 772.6572 773.2459 860.7554 873.4447 900.7472 963.0886 989.6644 995.8115 1027.3298 1111.4255 1142.3327 1162.0284 1182.5573 1242.1200 1288.1131 1310.2170 1324.9575 1335.8164 1372.0988 1433.5755 1459.9097 1494.7049 1531.2201 1633.5199 3163.2683 3183.4463 3196.4087 3214.5097 3248.0621
redmass: 12.2835 5.2916 8.2989 4.5053 6.8288 9.2562 9.0497 3.0223 6.5275 4.1089 7.1698 4.1335 7.2688 8.4427 12.4571 3.6290 5.5631 1.4730 6.0713 1.3556 1.3905 1.3423 1.2999 3.1440 3.6115 1.8194 1.9126 1.6197 2.5421 2.1245 3.5634 2.2011 4.0107 5.1407 4.0336 2.8059 5.9175 4.0236 5.8783 6.8941 1.0888 1.0921 1.0975 1.0982 1.0989
irintensity: 0.2448 2.1952 3.8522 1.0017 6.0006 1.2972 0.0526 16.1914 5.8028 0.1636 0.1832 0.5596 2.5298 5.6924 9.5938 14.3578 2.1347 95.9750 4.1628 1.2365 20.7742 5.5515 0.0382 5.8974 16.3236 15.2000 45.6672 6.8104 209.4783 107.0181 84.0818 118.0039 99.8138 4.9524 81.2241 28.1116 138.8833 35.8311 3.4327 12.7159 4.9376 3.1624 1.0302 9.8637 3.0626
temp: 298.150 k
press: 1.00000 atm
elementType: 8 8 7 7 7 6 6 6 6 6 6 6 1 1 1 1 1
symmnumber: 1
zpe: 307167.1 jmol-1
zpe.correction: 0.116994 hartree
zpe.thermalcorrener: 0.125631 hartree
zpe.thermalcorrenthalpy: 0.126575 hartree
zpe.thermalcorrgfe: 0.082789 hartree
zpe.sumelectzpe: -583.514015 hartree
zpe.sumelectthermal: -583.505379 hartree
zpe.sumelectthermalent: -583.504434 hartree
zpe.sumelectthermalfe: -583.548221 hartree
dipole: -5.6988 -1.0515 0.0011
dipole: 5.7950
quadrupole: -70.2143 -70.7073 -69.6294
quadrupole: 8.6154 0.0032 -0.0014
quadrupole: -0.0306 -0.5237 0.5542 8.6154 0.0032 -0.0014
hfenergy: -583.6310092 hartree
pointgroup: C01 [X(C7H5N3O2)]
dipole: -2.2317906 0.4659912 -0.000433 debye
dipolederiv: -1.1480925 0.1121937 0.0000077 0.2713262 -0.4294452 -0.0000575 -0.0003648 0.0000659 -0.2425448 -0.4707623 0.0158791 -0.0000295 -0.3401576 -0.8375155 0.0000298 -0.0001361 -0.00021 -0.2712299 0.3909213 -0.1581411 0.0000419 0.0366091 -0.5305279 -0.0000378 0.0000397 -0.0000012 0.0853174 -0.9970413 -0.1136725 -0.000068 0.3335431 -0.3583208 0.0000118 -0.0000175 -0.0000281 -0.2636118 2.0798464 0.1522754 0.0001535 0.5649139 1.1634407 0.0001267 0.0004712 0.0001252 0.2321022 0.3964499 -0.1050302 0.0000133 -0.7717231 0.35619 -0.0000446 -0.0000021 0.0000076 0.0635379 -0.9285046 -0.1665482 -0.0001177 -0.7542611 -0.3656378 -0.0001104 -0.0000447 0.0000064 0.0322516 -0.0823235 0.0157356 -0.0000288 0.0183296 0.1032677 0.0000111 -0.0000147 0.0000119 -0.0727421 -0.1963717 0.1162235 -0.0000134 0.2912106 0.0220358 0.0000251 0.0000086 0.0000064 -0.11999 0.5192309 0.2063665 0.0000356 0.4750368 0.4450387 0.0000691 0.0000787 0.0000406 -0.0481357 0.0907114 -0.1149186 0.0000178 0.0520958 0.0748313 0.0000115 -0.0000073 0.0000064 -0.1531317 0.068549 0.0441322 -0.0000043 -0.2345587 0.0319676 -0.0000197 -0.0000012 0.0000001 -0.1198753 0.1165311 -0.0587666 0.0000008 0.0190497 0.1076337 -0.0000011 0.0000081 -0.000015 0.1989875 0.0713506 0.0225356 -0.0000038 0.0223142 0.1183947 -0.000005 -0.0000058 -0.000008 0.1719403 0.0726166 -0.0332697 -0.0000028 -0.0599089 0.0324343 -0.0000046 -0.0000144 -0.000003 0.1745409 0.0879079 0.0406187 -0.0000004 0.0502097 -0.0347251 -0.0000033 0. -0.0000044 0.1679833 -0.0710193 0.0243866 -0.0000019 0.0259707 0.1009377 -0.0000012 0.0000021 -0.0000007 0.1645999 unknown
polarizability: 172.6875812|-9.230439|118.1604397|0.0090839|0.0045626|38.6359451 unknown
InChI: InChI=1S/C7H5N3O2/c11-10(12)7-5-8-6-3-1-2-4-9(6)7/h1-5H
charge 0 multiplicity 1
17 atoms
O  3.414441 -0.198519 0.000418
O  2.180096 1.742212 0.000409
N  -0.209954 0.194346 -0.000091
N  -0.361459 -2.119277 -0.000184
N  2.284888 0.437843 -0.000036
C  -1.081455 -0.94459 -0.00013
C  1.095797 -0.33693 -0.000096
C  -0.698686 1.494939 -0.000062
C  -2.480397 -0.736027 -0.000135
C  0.956981 -1.746326 -0.000131
C  -2.077085 1.685137 -0.000063
C  -2.97658 0.573085 -0.0001
H  0.045477 2.291098 -0.000038
H  1.768364 -2.469935 -0.000148
H  -3.130241 -1.613907 -0.000172
H  -2.457538 2.709452 -0.000038
H  -4.05605 0.749699 -0.000104
