program: Gaussian 09
title: 000259807
version: EM64L-G09RevD.01
frameworkgroup: C1[X(C9H10N2)]
method: RPBEPBE
basis: SDD
operation: Freq
keyword: #pfreq=noraman
keyword: PBEPBE/SDD
title: #p freq=noraman PBEPBE/SDD
converged: YES YES NO NO
title: Mulliken charges:
elementType: N N C C C C C C C C C H H H H H H H H H H
charge: -0.184213 -0.104320 0.178091 -0.375193 -0.349742 0.412135 0.212395 -0.308764 -0.288601 -0.809930 -0.784784 0.252929 0.264990 0.253720 0.238993 0.234506 0.221874 0.234502 0.241386 0.218752 0.241273
chargesum: 0.00000
title: Mulliken charges with hydrogens summed into heavy atoms:
elementType: N N C C C C C C C C C
charge: -0.184213 -0.104320 0.178091 -0.122264 -0.084752 0.412135 0.212395 -0.055044 -0.049608 -0.119049 -0.083373
polarizability: 1.76632400e+02 6.12870749e+00 1.07969260e+02 5.74523480e-03 7.25698832e-03 5.38988541e+01
1716.lowfreq: -7.7115 -0.0009 -0.0003 -0.0003 4.9450 10.3807 92.9474 106.0522 131.1048
frequency: 92.8715 106.0414 131.0957 183.5027 219.9240 278.5593 321.6960 346.6481 434.1908 444.6862 471.1891 582.5580 586.4797 645.4034 670.3880 721.4125 747.1390 755.3685 808.1460 815.3979 843.9459 932.3739 959.0129 971.2899 989.9950 1011.9295 1046.0915 1049.0874 1129.1198 1144.7398 1174.5520 1251.7387 1262.1911 1309.6401 1333.0726 1367.9979 1399.8233 1402.3534 1416.8456 1458.5827 1467.3986 1469.2649 1476.5679 1517.8467 1531.0334 1547.8383 1645.5889 2976.7995 2987.6872 3055.5908 3070.3748 3084.1938 3095.5242 3140.9303 3165.4083 3184.5550 3240.6418
redmass: 1.3094 1.6120 1.2109 3.8232 2.8818 3.2911 2.6933 4.1635 2.9549 5.1973 3.7488 4.7424 2.8555 2.8438 5.6597 1.5756 4.1563 5.3671 1.4680 4.3336 1.4065 2.8597 1.2983 4.9338 1.5708 1.5000 1.5125 1.4932 1.5509 3.8823 1.3710 2.0499 2.9245 2.3134 3.3797 2.3445 1.4926 1.2334 3.6260 1.0450 1.0451 1.2289 1.1548 3.9401 4.5196 4.8136 6.6696 1.0369 1.0367 1.0980 1.0978 1.0989 1.0995 1.0900 1.0935 1.0958 1.0993
irintensity: 1.3770 0.4874 0.0006 3.8255 2.4067 0.2855 0.9776 10.3249 8.4469 1.6225 2.9816 0.2412 3.0223 9.7203 1.7701 29.6909 4.3042 0.7193 63.6838 0.9956 8.7879 0.1517 0.8357 3.4728 4.5278 2.9720 8.9862 10.6239 15.6027 24.2941 9.4361 28.1980 13.2454 4.7538 51.8803 4.8330 5.0592 2.5786 42.8907 13.5396 13.4575 17.4346 13.9899 13.8746 47.8376 8.3083 0.0076 43.3141 33.2839 20.6980 16.9692 19.7950 21.2649 8.5920 5.5345 4.2032 0.2185
temp: 298.150 k
press: 1.00000 atm
elementType: 7 7 6 6 6 6 6 6 6 6 6 1 1 1 1 1 1 1 1 1 1
symmnumber: 1
zpe: 445455.4 jmol-1
zpe.correction: 0.169665 hartree
zpe.thermalcorrener: 0.179313 hartree
zpe.thermalcorrenthalpy: 0.180257 hartree
zpe.thermalcorrgfe: 0.134935 hartree
zpe.sumelectzpe: -457.674392 hartree
zpe.sumelectthermal: -457.664744 hartree
zpe.sumelectthermalent: -457.663800 hartree
zpe.sumelectthermalfe: -457.709122 hartree
dipole: 2.4375 -2.6394 0.0023
dipole: 3.5928
quadrupole: -57.1447 -60.6812 -68.7142
quadrupole: 5.0819 -0.0047 0.0034
quadrupole: 5.0353 1.4989 -6.5342 5.0819 -0.0047 0.0034
hfenergy: -457.844057 hartree
pointgroup: C01 [X(C9H10N2)]
dipole: -0.959114 -1.0383098 -0.0008912 debye
dipolederiv: -0.2480769 -0.1487428 0.0003124 -0.74614 -0.143197 -0.0002272 -0.0000315 -0.0000466 0.066951 -0.8125345 0.0994237 -0.0001494 0.0020949 -0.4036777 -0.0000527 0.0002535 -0.0001845 -0.2695619 0.493028 0.0904753 0.0003708 0.5969688 -0.0114529 0.0002219 0.0001841 -0.000037 0.0336121 0.159188 -0.0451021 -0.0001235 0.0652833 0.0883323 -0.000044 0.0000737 -0.0000864 -0.1375523 -0.3931917 0.0292823 -0.0000425 0.0510831 -0.0768804 0.000043 0.0003295 0.000303 -0.2514969 0.2471367 0.1152912 0.0001384 0.1389842 -0.0186941 -0.0001023 -0.0000082 0.0001064 -0.0416996 0.7180418 -0.0651945 -0.0006999 0.0814417 0.3000613 0.0000259 -0.0019393 0.0001665 -0.0090207 0.1274218 -0.0924268 -0.0000675 -0.0655074 0.1045027 -0.0000177 0.000088 -0.0000423 -0.1283196 -0.2333531 -0.0374771 0.0000969 -0.1178307 0.0751692 0.0000781 -0.0001111 -0.0000387 -0.1918616 -0.0656791 -0.0505093 -0.0000141 0.0008186 0.0706887 -0.000004 0.0000159 -0.0000239 0.0698203 -0.1804773 0.0432586 0.0000846 -0.0914082 0.1077723 -0.000278 0.0017832 -0.0004477 0.0481667 0.0504634 -0.0093967 -0.0000418 -0.0391323 -0.0528719 0.0000166 0.0000115 0.0000248 0.1826612 0.0899279 -0.0246228 -0.0000407 0.0200328 -0.0227453 0.0000829 0.0000453 -0.0000653 0.2313738 0.0895808 -0.0430657 -0.0000267 -0.0112263 -0.0351671 0.0000007 0.0000564 -0.0000053 0.1678817 -0.0449015 0.1061995 -0.0000553 0.0854715 0.0272387 0.0000291 -0.0000654 0.0000376 0.159669 -0.0410269 -0.0004586 0.0814461 0.0238234 0.0733117 -0.0805595 0.138198 -0.0461098 -0.0421494 0.069796 0.0512994 -0.0000138 -0.0752524 -0.1482067 -0.0000077 -0.0000063 0.0000299 0.1098945 -0.0409294 -0.0004951 -0.0814422 0.0237872 0.0733214 0.080571 -0.1382252 0.0460957 -0.0422746 -0.0142273 -0.0130833 -0.0541311 -0.034858 0.0633516 -0.093226 -0.1203659 -0.0730068 -0.0345243 0.0446452 0.0079338 -0.0000175 0.1250117 -0.1358439 0.0012257 -0.0007559 0.0011212 0.1151744 -0.014832 -0.0125891 0.0544169 -0.0334459 0.0649871 0.0922241 0.1204697 0.0722092 -0.0367438 unknown
polarizability: 176.6308528|-6.1373704|107.9708072|0.0057443|-0.0072577|53.8988541 unknown
InChI: InChI=1S/C9H10N2/c1-7-3-4-9-10-8(2)6-11(9)5-7/h3-6H,1-2H3
charge 0 multiplicity 1
21 atoms
N  0.130758 -0.610746 0.000764
N  1.724677 1.049728 0.001356
C  0.385148 0.804086 0.000788
C  -1.161557 -1.126327 0.000394
C  1.380888 -1.236899 0.001581
C  -2.255385 -0.267425 -0.000004
C  2.338777 -0.204784 0.000664
C  -0.731782 1.682515 0.000426
C  -2.024165 1.157325 0.000012
C  -3.669694 -0.814497 -0.000306
C  3.833835 -0.342635 -0.000464
H  -1.259777 -2.214972 0.000534
H  1.491063 -2.317556 0.001934
H  -0.537635 2.75775 0.000488
H  -2.88755 1.831806 -0.000237
H  -4.229659 -0.470797 0.889618
H  -3.68117 -1.918213 -0.000259
H  -4.22923 -0.470875 -0.890528
H  4.270544 0.153548 0.885004
H  4.140628 -1.402318 0.004631
H  4.268683 0.144184 -0.892097
