program: Gaussian 09
title: 000259830
version: EM64L-G09RevD.01
frameworkgroup: C1[X(C21H14)]
method: RPBEPBE
basis: SDD
operation: Freq
keyword: #p
keyword: freq=noraman
keyword: PBEPBE/SDD
title: #p freq=noraman PBEPBE/SDD
converged: YES YES YES YES
title: Mulliken charges:
elementType: C C C C C C C C C C C C C C C C C C C C C H H H H H H H H H H H H H H
charge: -0.765626 0.364929 -0.083004 0.152644 0.400757 0.316896 0.453327 -0.652619 -0.624770 0.400101 0.423286 -0.428898 -0.419227 -0.468227 -0.478744 -0.250699 -0.262769 -0.431746 -0.437516 -0.243062 -0.246121 0.241982 0.241972 0.243629 0.226500 0.237480 0.219596 0.239404 0.239793 0.227014 0.225458 0.241163 0.241541 0.227776 0.227782
chargesum: 0.00000
title: Mulliken charges with hydrogens summed into heavy atoms:
elementType: C C C C C C C C C C C C C C C C C C C C C
charge: -0.281673 0.364929 -0.083004 0.152644 0.400757 0.316896 0.453327 -0.408990 -0.398270 0.400101 0.423286 -0.191419 -0.199630 -0.228823 -0.238951 -0.023685 -0.037312 -0.190583 -0.195975 -0.015286 -0.018339
polarizability: 4.14315350e+02 2.48353226e+00 2.54143843e+02 -5.65290457e-03 6.87750712e-03 8.73064788e+01
1716.lowfreq: -20.5613 -10.7580 -0.7636 -0.0007 0.0005 0.0008 4.8314 57.9904 102.1717
frequency: -19.5360 57.9894 102.1652 146.1938 151.7855 197.3421 220.0296 248.6271 282.1746 303.4588 308.9605 411.8709 432.0353 448.3078 456.4422 463.8987 476.4853 491.6849 502.4137 540.3684 557.2180 587.0493 594.8234 617.0212 634.3032 639.3905 701.7017 726.8490 757.0793 757.2235 764.8731 785.2126 786.9627 790.1067 818.9987 837.1841 857.0158 873.6551 896.5726 903.4205 911.8166 926.1611 931.9927 962.0738 971.8957 979.9823 987.9529 989.3193 1020.8562 1038.2534 1055.2378 1086.6325 1107.9605 1140.0846 1170.2578 1174.4148 1182.7985 1192.2268 1210.4896 1217.7421 1239.5339 1244.2802 1262.2658 1288.0464 1292.2701 1310.0205 1333.2312 1377.6627 1393.9492 1405.6626 1414.7941 1426.6558 1433.7561 1436.1054 1448.8563 1461.1574 1475.5999 1506.9234 1526.8462 1576.7823 1592.0786 1595.8616 1605.3295 1627.7611 1641.3879 2955.4417 2992.3614 3104.8373 3113.9074 3117.8851 3122.9262 3124.0580 3127.1669 3137.5938 3141.0885 3146.1159 3155.0167 3160.8721 3164.3483
redmass: 3.6824 4.1448 3.3860 3.6196 5.0729 4.3354 3.1637 3.3922 6.9922 5.2931 4.5795 3.1736 4.4846 5.3134 3.2703 2.9491 2.8197 5.9778 7.3172 3.6877 6.9728 6.6444 3.3493 5.7727 3.2923 6.6242 2.3473 5.6461 1.3267 5.3760 1.6465 1.5681 2.1716 5.3224 4.2405 1.9713 1.3496 5.2803 1.7901 1.3616 1.7984 1.5851 5.2519 1.5373 1.6717 1.4872 1.4191 1.3687 2.2694 4.0590 3.6458 2.0576 2.1694 1.5872 1.1762 1.2681 1.2997 1.2864 1.0943 1.4406 1.6292 2.1292 1.6830 2.0766 2.1339 2.9089 2.2201 2.7020 5.1376 2.9923 3.7808 2.0866 3.5568 1.6057 3.0740 2.4450 2.7100 4.2354 4.3895 6.5989 6.1288 5.6877 6.1109 6.8930 6.9278 1.0604 1.0984 1.0911 1.0878 1.0858 1.0889 1.0866 1.0894 1.0911 1.0947 1.0918 1.0991 1.1003 1.0959
irintensity: 0.3837 0.0389 4.3813 0.0148 0.0901 3.4546 4.1435 1.3278 0.2415 0.1615 1.9644 0.0621 1.2323 1.3596 0.0674 5.1626 12.3327 0.0894 1.2656 0.4778 3.4620 5.6404 2.5344 1.1162 0.5096 0.3615 2.2946 2.5281 83.9673 0.8090 4.6577 10.9547 26.6494 0.3658 1.5276 68.0024 7.0099 1.0929 4.3796 15.2825 21.9343 0.2536 1.2865 1.2961 14.6738 3.4954 6.7650 1.0164 6.1448 5.8736 1.4471 5.0563 4.6701 1.4212 1.1326 0.9172 8.7039 1.1973 0.0105 1.2416 8.6473 4.7289 4.8229 0.7119 7.4351 1.3974 4.4877 7.2084 4.8995 19.1243 1.7645 1.2562 1.5960 7.0638 3.6569 1.9946 0.1181 31.6341 7.9995 0.3256 23.2378 0.5886 6.7891 4.5229 1.0322 14.3056 9.3039 13.7232 9.4651 5.6809 0.7044 2.2098 10.3223 15.0154 36.2471 12.3847 51.0408 47.1324 28.1543
temp: 298.150 k
press: 1.00000 atm
elementType: 6 6 6 6 6 6 6 6 6 6 6 6 6 6 6 6 6 6 6 6 6 1 1 1 1 1 1 1 1 1 1 1 1 1 1
symmnumber: 1
zpe: 728929.4 jmol-1
zpe.correction: 0.277635 hartree
zpe.thermalcorrener: 0.291255 hartree
zpe.thermalcorrenthalpy: 0.292199 hartree
zpe.thermalcorrgfe: 0.237875 hartree
zpe.sumelectzpe: -807.298022 hartree
zpe.sumelectthermal: -807.284402 hartree
zpe.sumelectthermalent: -807.283458 hartree
zpe.sumelectthermalfe: -807.337782 hartree
dipole: 0.0504 -0.5322 0.0001
dipole: 0.5346
quadrupole: -105.5929 -102.4405 -130.2896
quadrupole: 0.2540 -0.0003 0.0011
quadrupole: 7.1814 10.3338 -17.5152 0.2540 -0.0003 0.0011
hfenergy: -807.575657 hartree
pointgroup: C01 [X(C21H14)]
dipole: 0.0210819 0.2092795 -0.0000356 debye
polarizability: 414.2799419|-3.4406562|254.1792518|0.0056939|0.0068436|87.3064788 unknown
InChI: InChI=1S/C21H14/c1-2-6-16-13-20-18(11-15(16)5-1)12-17-9-3-7-14-8-4-10-19(20)21(14)17/h1-11,13H,12H2
charge 0 multiplicity 1
35 atoms
C  -0.623844 2.059469 -0.000029
C  0.551996 1.095074 0.000146
C  -2.168276 0.002616 0.000026
C  0.352887 -0.337018 0.000007
C  -2.005898 1.43043 0.00002
C  -1.028614 -0.893443 0.000038
C  -3.512672 -0.546467 0.000055
C  1.847081 1.620652 0.000321
C  1.49164 -1.164658 -0.000127
C  3.008948 0.790227 0.000285
C  2.819942 -0.644985 0.000003
C  -3.136349 2.259778 0.000036
C  -1.269685 -2.279974 0.000158
C  -4.640004 0.336928 0.000046
C  -3.695703 -1.967239 0.000107
C  -4.455014 1.720253 0.000037
C  -2.588622 -2.815912 0.000175
C  4.341389 1.320086 0.000472
C  3.975322 -1.498172 -0.000113
C  5.44654 0.465916 0.000366
C  5.261484 -0.955605 0.000066
H  -0.535129 2.728742 -0.88053
H  -0.535188 2.729128 0.880176
H  1.981632 2.710798 0.000457
H  1.381607 -2.254032 -0.000357
H  -3.001661 3.348844 0.000049
H  -0.434118 -2.985571 0.000283
H  -5.648388 -0.0933 0.000063
H  -4.714769 -2.371356 0.000111
H  -5.317077 2.396068 0.000038
H  -2.724536 -3.902884 0.00026
H  4.480703 2.407968 0.000693
H  3.832079 -2.585609 -0.000329
H  6.462112 0.877005 0.000512
H  6.137884 -1.61306 -0.000021
