program: Gaussian 09
title: 000259908
version: EM64L-G09RevD.01
frameworkgroup: C1[X(C19H18Cl4N2O)]
method: RPBEPBE
basis: SDD
operation: Freq
keyword: #p
keyword: freq=noraman
keyword: PBEPBE/SDD
title: #p freq=noraman PBEPBE/SDD
converged: YES YES NO NO
title: Mulliken charges:
elementType: Cl Cl Cl Cl O N N C C C C C C C C C C C C C C C C C C C H H H H H H H H H H H H H H H H H H
charge: -0.038544 -0.019370 -0.053891 -0.054184 -0.221415 -0.183892 -0.472473 0.303618 -0.698687 0.167719 0.412764 0.270778 0.489590 -0.614823 -0.401881 -0.627077 -0.389357 -0.479769 0.738984 -0.388283 -0.389997 -0.313308 -0.586800 -0.587306 0.220929 -0.771906 0.259407 0.264129 0.249720 0.241822 0.235374 0.267631 0.249837 0.250689 0.251918 0.251761 0.294211 0.269084 0.294100 0.269598 0.309281 0.256940 0.258708 0.214370
chargesum: 0.00000
title: Mulliken charges with hydrogens summed into heavy atoms:
elementType: Cl Cl Cl Cl O N N C C C C C C C C C C C C C C C C C C C
charge: -0.038544 -0.019370 -0.053891 -0.054184 -0.221415 -0.183892 -0.163193 0.303618 -0.175150 0.167719 0.412764 0.270778 0.489590 -0.365103 -0.160059 -0.627077 -0.153983 -0.212138 0.738984 0.112242 0.113682 -0.313308 -0.023504 -0.023608 0.220929 -0.041888
polarizability: 4.94432573e+02 1.62711775e+00 2.83159753e+02 -5.80564632e-01 1.84106684e+01 1.42007128e+02
1716.lowfreq: -5.2801 -2.8152 -0.0006 -0.0004 0.0018 1.0792 19.6392 21.3548 29.6699
frequency: 19.6029 21.3362 29.6642 30.5652 43.3385 60.5841 67.2686 71.2379 76.0487 89.5036 98.3323 107.9922 124.8799 134.3849 159.8604 165.8883 196.3226 204.8095 215.8643 225.4801 241.8598 262.0624 271.2293 278.9188 289.3699 319.6273 340.0633 363.3300 392.4212 403.5100 431.4705 446.9767 478.9954 523.7304 526.1947 533.4807 546.2198 556.6224 569.9648 580.2820 605.2778 643.0306 665.5225 681.6320 696.9437 701.1416 711.6541 739.6510 746.6546 778.1818 784.9867 791.2475 803.7837 813.5470 848.1166 877.8201 880.0167 909.2484 941.7830 950.9135 963.3183 973.6094 999.1409 1006.4749 1031.8211 1034.5256 1036.4979 1037.5598 1048.8678 1118.3539 1123.9596 1131.5378 1157.5490 1177.5539 1201.9808 1208.4349 1219.2585 1219.8220 1241.3825 1255.5683 1256.9500 1273.3345 1290.2589 1292.2749 1311.9891 1348.9617 1351.7198 1355.7775 1370.8990 1384.1266 1387.5639 1411.1085 1427.0706 1444.4143 1449.1313 1456.0254 1459.5551 1461.8079 1466.5988 1469.8943 1486.3940 1494.1228 1508.8581 1563.0717 1585.0973 1615.9583 1633.6394 1645.3596 2990.0116 2994.0450 3014.2045 3019.4243 3034.2635 3062.4374 3062.9119 3069.8958 3075.3487 3084.3998 3120.1501 3133.4247 3146.2501 3147.0211 3149.1825 3165.5543 3167.9563 3527.8004
redmass: 12.9196 8.1888 17.2448 14.6991 7.0999 3.5629 3.5617 3.4485 1.4869 4.0663 5.4615 3.4147 2.9654 7.7066 6.3860 11.7754 9.9528 3.8215 3.8152 5.3549 4.1263 5.0499 5.6758 2.9108 5.0238 8.5408 5.1496 6.7889 4.2493 4.7674 2.9547 3.5271 4.1354 1.5167 4.8321 4.4667 3.3647 3.9533 4.1453 3.4330 5.4157 4.3305 7.2020 6.2355 5.3786 5.6300 4.5086 5.9243 3.5333 2.7413 1.2594 1.4242 4.7673 1.4967 1.4795 4.2291 1.5515 4.3757 1.6852 1.7677 2.6416 2.4713 1.4279 2.1834 2.2932 4.5186 3.5966 1.8397 2.1858 1.7890 2.1158 1.1404 1.4813 2.3552 1.7283 2.6344 1.5456 2.2537 2.1937 1.1652 1.1647 1.4840 1.4533 1.4305 2.3214 2.4237 1.2830 1.9998 4.3474 1.2295 1.9882 2.4634 1.4675 1.4614 2.3492 1.8283 1.1163 1.4233 1.8657 1.1487 1.1435 2.7651 1.1926 7.9064 6.9748 9.7154 7.3253 7.0851 1.0611 1.0371 1.0601 1.0608 1.0992 1.0573 1.0585 1.1023 1.1037 1.0988 1.0988 1.0891 1.1089 1.1112 1.0940 1.0939 1.0929 1.0767
irintensity: 0.4309 0.3815 0.7665 0.5482 2.0612 3.3591 5.7751 1.2120 1.1368 0.6527 1.3101 1.0484 2.5333 3.5155 1.3799 0.8869 4.7073 2.8293 4.6971 0.1061 11.9606 4.2428 2.3867 6.4837 2.6441 2.3293 4.0092 7.9754 6.2214 8.9058 7.2151 3.7177 5.5615 93.7362 4.4531 2.2366 7.1753 2.6394 3.7647 10.4123 2.6402 5.6242 101.6382 6.7586 87.2832 37.2660 8.1516 24.5338 1.2476 1.3228 3.1179 17.6925 25.5401 43.3331 21.9888 0.8706 13.2343 12.4649 2.9143 7.0507 37.0962 6.9010 4.1212 25.6529 32.7350 0.8463 14.0708 10.9044 32.6568 40.6022 25.3335 0.1062 30.0073 12.4110 79.0639 45.2134 4.7294 43.4733 118.4469 19.4836 23.6995 84.9249 17.5100 20.0100 11.5951 228.7347 11.8648 9.5518 6.1580 63.9069 19.0421 40.9441 34.3596 81.7157 132.9512 50.2357 29.5743 72.1232 358.2154 51.3837 27.7810 54.6924 68.7998 48.7478 40.5010 144.5694 298.3049 138.5247 6.2979 12.3001 23.5424 24.4512 3.7139 9.3249 19.8298 10.1276 9.4142 14.7044 10.0685 11.4465 5.1050 25.8545 13.5242 23.7631 3.2855 20.8240
temp: 298.150 k
press: 1.00000 atm
elementType: 17 17 17 17 8 7 7 6 6 6 6 6 6 6 6 6 6 6 6 6 6 6 6 6 6 6 1 1 1 1 1 1 1 1 1 1 1 1 1 1 1 1 1 1
symmnumber: 1
zpe: 863846.8 jmol-1
zpe.correction: 0.329022 hartree
zpe.thermalcorrener: 0.355105 hartree
zpe.thermalcorrenthalpy: 0.356049 hartree
zpe.thermalcorrgfe: 0.268518 hartree
zpe.sumelectzpe: -2757.939165 hartree
zpe.sumelectthermal: -2757.913082 hartree
zpe.sumelectthermalent: -2757.912138 hartree
zpe.sumelectthermalfe: -2757.999669 hartree
dipole: -1.8528 2.5099 -2.3137
dipole: 3.8840
quadrupole: -182.2353 -192.4134 -184.5380
quadrupole: 17.1649 -12.1104 4.7509
quadrupole: 4.1603 -6.0178 1.8576 17.1649 -12.1104 4.7509
hfenergy: -2758.2681874 hartree
pointgroup: C01 [X(C19H18Cl4N2O1)]
dipole: -0.7416834 -0.952901 0.9364537 debye
polarizability: 494.2084496|0.3688815|284.5287766|9.1157756|11.951222|140.8622283 unknown
InChI: InChI=1S/C19H18Cl4N2O/c1-11(26)24-19-17(22)10-15-14-3-2-13(25(6-4-20)7-5-21)8-12(14)9-16(15)18(19)23/h2-3,8,10,24H,4-7,9H2,1H3
charge 0 multiplicity 1
44 atoms
Cl 3.441923 -2.835297 -0.132117
Cl 4.700131 2.488678 1.045406
Cl -6.8929 3.238776 -0.896326
Cl -5.869308 -3.944347 0.347704
O  5.945529 0.90823 -1.436706
N  -4.4947 -0.051927 -0.089964
N  5.312624 -0.475808 0.343111
C  -0.80256 -0.679259 0.036593
C  0.35002 -1.674409 -0.061663
C  -0.29722 0.630934 0.288168
C  1.567905 -0.790337 0.151729
C  1.169371 0.567824 0.358814
C  -3.10321 0.163749 0.037909
C  -2.176072 -0.92216 -0.083178
C  -1.200676 1.706611 0.417606
C  2.926333 -1.103147 0.151375
C  -2.5835 1.475728 0.290532
C  2.131266 1.572005 0.594519
C  3.936443 -0.119825 0.362748
C  -5.465586 1.039866 0.09931
C  -5.039408 -1.378575 -0.426259
C  3.490938 1.207707 0.614429
C  -5.650493 1.847251 -1.200233
C  -5.21563 -2.239935 0.839257
C  6.25089 0.054885 -0.562993
C  7.670265 -0.468926 -0.366893
H  0.284121 -2.472027 0.703492
H  0.382679 -2.185607 -1.043079
H  -2.525161 -1.94298 -0.264895
H  -0.843689 2.724868 0.607684
H  -3.259635 2.329995 0.384082
H  1.845241 2.610585 0.779868
H  -6.438472 0.610944 0.397905
H  -5.153397 1.709399 0.919786
H  -6.0206 -1.254116 -0.917734
H  -4.389668 -1.900563 -1.15052
H  -4.722256 2.335477 -1.529492
H  -6.073696 1.238066 -2.012741
H  -4.265547 -2.419305 1.362246
H  -5.961395 -1.819732 1.530434
H  5.588661 -1.29947 0.882545
H  8.245719 0.2638 0.227794
H  8.156422 -0.558202 -1.350837
H  7.711999 -1.443423 0.151081
