program: Gaussian 09
title: 000259823
version: EM64L-G09RevD.01
frameworkgroup: C1[X(C10H12N4O4S)]
method: RPBEPBE
basis: SDD
operation: Freq
keyword: #p
keyword: freq=noraman
keyword: PBEPBE/SDD
title: #p freq=noraman PBEPBE/SDD
converged: YES YES NO NO
title: Mulliken charges:
elementType: S O O O O N N N N C C C C C C C C C C H H H H H H H H H H H H
charge: 0.226780 -0.439971 -0.451648 -0.423595 -0.194974 -0.110730 -0.366463 -0.026570 -0.000910 -0.045486 -0.581734 -0.135416 -0.445798 -0.311530 0.324787 -0.225073 -0.118567 0.035932 -0.235063 0.314473 0.250656 0.239119 0.324993 0.194913 0.247578 0.374585 0.287143 0.368726 0.334051 0.347447 0.242343
chargesum: 0.00000
title: Mulliken charges with hydrogens summed into heavy atoms:
elementType: S O O O O N N N N C C C C C C C C C C
charge: 0.226780 -0.065386 -0.082922 -0.076148 -0.194974 -0.110730 -0.032412 -0.026570 -0.000910 0.205170 -0.267261 0.103703 -0.120805 0.130961 0.324787 0.062070 -0.118567 0.035932 0.007280
polarizability: 2.25764254e+02 -1.81981962e+00 1.51598949e+02 -6.31279571e+00 -1.15865920e+01 1.15422375e+02
1716.lowfreq: -8.3805 -2.0758 -0.0006 0.0005 0.0011 5.8007 21.1536 27.9353 40.6244
frequency: 20.9677 27.4111 40.5641 71.8228 96.9112 109.0618 123.8440 160.5058 173.9620 200.4341 240.7448 251.0312 261.2763 286.2038 297.3848 321.6905 324.8754 356.6422 377.1028 410.1716 481.8038 484.4756 491.0765 535.3857 542.5718 544.7792 568.9446 587.6032 636.4089 657.8377 658.6883 670.8029 690.3319 744.9773 769.9049 783.4511 798.3677 858.9969 882.9888 889.1063 929.4999 953.7353 969.7786 999.9603 1006.1370 1016.6588 1021.9230 1057.2771 1073.4172 1096.3616 1130.1478 1147.0127 1156.2224 1180.4996 1188.0542 1234.1805 1247.5991 1257.8452 1273.9219 1298.3495 1313.8937 1322.5570 1331.4357 1335.0433 1345.5725 1359.8402 1367.5842 1373.4793 1381.4241 1413.1785 1456.5503 1512.7097 1522.4155 1594.7781 1637.6607 2954.3926 2954.8966 2996.8981 3053.0882 3066.7263 3082.0099 3124.6212 3255.4035 3470.8858 3526.6503 3550.7142 3582.6732
redmass: 6.6287 7.4014 7.1489 6.2928 5.7725 7.2129 6.3680 4.7500 5.1886 8.5227 3.4056 3.2695 3.0464 3.1378 2.9604 2.6742 2.7490 1.8694 6.4520 7.5821 5.1228 6.5363 3.6042 1.4361 1.5981 3.2167 2.4534 6.6441 4.0964 6.1868 8.6096 5.6846 4.4867 5.7807 3.7010 5.3321 1.8980 7.7291 3.5754 1.4623 8.1069 1.8605 5.2913 2.9909 2.7870 3.2015 3.6289 3.7993 3.6584 2.6287 2.0919 1.1615 1.3534 1.2877 1.7431 1.5256 1.2506 2.7530 1.2263 1.3364 1.2889 3.7723 2.3145 1.1811 1.5158 1.4530 1.4751 1.2851 1.5024 4.3226 1.0787 4.1248 7.5187 6.6801 12.4264 1.0748 1.0774 1.0861 1.0859 1.0923 1.0892 1.0927 1.0980 1.0648 1.0796 1.0665 1.0670
irintensity: 0.1236 4.6263 12.8491 3.2422 2.5211 4.8033 1.4785 0.2220 1.4140 0.7630 3.5140 37.8595 3.3800 15.9103 24.7989 79.9818 55.4068 66.5653 4.3934 1.2127 8.0544 3.5263 14.0806 106.1873 55.0115 27.4931 80.7071 15.2443 7.2640 4.0909 11.1335 21.7754 45.4670 2.5182 21.9526 35.7136 7.8065 11.6336 18.9670 11.5432 54.1223 95.7007 75.1390 37.1402 16.5420 37.4502 80.2596 29.6713 20.4022 22.4555 14.5724 43.4775 26.0203 32.0901 56.5341 16.2141 17.7243 0.5683 33.5184 4.1000 22.5683 43.5063 9.0347 16.2303 57.8377 10.3121 6.7397 21.8119 6.6956 9.3875 5.3977 22.6329 364.2935 85.2691 394.0730 76.1516 9.6143 33.0631 4.1013 4.4720 10.7738 19.0060 1.4436 45.1936 37.5501 11.4543 23.9597
temp: 298.150 k
press: 1.00000 atm
elementType: 16 8 8 8 8 7 7 7 7 6 6 6 6 6 6 6 6 6 6 1 1 1 1 1 1 1 1 1 1 1 1
symmnumber: 1
zpe: 595481.7 jmol-1
zpe.correction: 0.226807 hartree
zpe.thermalcorrener: 0.244522 hartree
zpe.thermalcorrenthalpy: 0.245466 hartree
zpe.thermalcorrgfe: 0.179491 hartree
zpe.sumelectzpe: -1304.766928 hartree
zpe.sumelectthermal: -1304.749214 hartree
zpe.sumelectthermalent: -1304.748269 hartree
zpe.sumelectthermalfe: -1304.814244 hartree
dipole: 7.5850 5.8996 0.1107
dipole: 9.6098
quadrupole: -179.6119 -118.8824 -109.8205
quadrupole: -19.6737 21.2853 6.4567
quadrupole: -43.5070 17.2226 26.2844 -19.6737 21.2853 6.4567
hfenergy: -1304.9937353 hartree
pointgroup: C01 [X(C10H12N4O4S1)]
dipole: 3.071343 2.2022069 -0.1077724 debye
polarizability: 223.9889708|-5.1738236|152.4955772|-14.6315734|-9.8817138|116.3010308 unknown
InChI: InChI=1S/C10H12N4O4S/c15-1-4-6(16)7(17)10(19-4)14-3-13-5-8(14)11-2-12-9(5)18/h2-4,6-7,10-11,15-17H,1H2
charge 0 multiplicity 1
31 atoms
S  2.148888 -0.659182 -1.596717
O  1.964838 2.543934 -0.408438
O  3.570479 1.472997 1.519771
O  5.095792 -1.9033 -0.913193
O  -4.665942 -1.309237 1.175352
N  -0.359937 -0.274726 -0.381685
N  -2.140956 1.481556 -0.61412
N  -1.647349 -1.889727 0.612171
N  -4.31603 0.821617 0.216363
C  1.472851 1.330522 0.228048
C  0.803013 0.47849 -0.875041
C  2.659245 0.535615 0.835398
C  3.456005 -0.120352 -0.307277
C  4.292195 -1.320675 0.16018
C  -1.647134 0.239291 -0.252683
C  -0.422719 -1.580317 0.172372
C  -2.440331 -0.752592 0.358152
C  -3.865918 -0.507348 0.634929
C  -3.509135 1.690661 -0.342412
H  0.483233 1.147997 -1.6916
H  0.728944 1.579472 1.015184
H  2.277052 -0.236406 1.534593
H  4.102106 0.626445 -0.796199
H  3.635265 -2.080118 0.63729
H  5.029439 -0.965567 0.901278
H  2.747154 2.854169 0.126376
H  0.441451 -2.237565 0.164687
H  3.346089 1.537985 2.481579
H  -1.571343 2.214054 -1.043831
H  4.504557 -2.381894 -1.549046
H  -3.886102 2.677302 -0.639881
