program: Gaussian 09
title: 000259800
version: EM64L-G09RevD.01
frameworkgroup: C1[X(C19H14N2O)]
method: RPBEPBE
basis: SDD
operation: Freq
keyword: #p
keyword: freq=noraman
keyword: PBEPBE/SDD
title: #p freq=noraman PBEPBE/SDD
converged: YES YES NO NO
title: Mulliken charges:
elementType: O N N C C C C C C C C C C C C C C C C C C C H H H H H H H H H H H H H H
charge: -0.268945 -0.125827 -0.129577 0.376188 0.383616 0.328623 -0.550599 -0.408877 -0.389771 0.094916 0.314019 -0.412368 -0.408735 0.098701 0.452814 -0.510712 -0.240840 -0.236639 -0.366137 -0.397279 -0.213290 -0.812678 0.281035 0.239958 0.256069 0.246444 0.241112 0.256754 0.232336 0.275605 0.231134 0.236098 0.232601 0.239229 0.225969 0.229053
chargesum: 0.00000
title: Mulliken charges with hydrogens summed into heavy atoms:
elementType: O N N C C C C C C C C C C C C C C C C C C C
charge: -0.268945 -0.125827 -0.129577 0.376188 0.383616 0.328623 -0.269563 -0.168919 -0.133702 0.094916 0.314019 -0.165924 -0.167623 0.098701 0.452814 -0.253958 -0.008504 -0.005505 -0.090532 -0.161181 0.019311 -0.118426
polarizability: 4.80787750e+02 -6.62332019e-02 2.26732290e+02 -1.13275168e-01 1.88656291e-01 8.88908731e+01
1716.lowfreq: -7.5338 -0.0005 -0.0004 0.0008 3.7565 5.6706 13.0439 22.6771 31.3234
frequency: 12.2215 22.3656 31.3088 45.3245 74.9675 96.3961 119.9670 170.4547 184.4922 204.6951 208.7665 265.6195 285.2218 332.5994 338.2981 377.0272 402.7842 433.0079 436.4616 479.7529 505.9136 510.8822 515.3864 527.3111 538.8357 589.9934 635.0774 640.0113 672.6359 674.6100 697.5146 710.8316 757.2462 763.0839 790.6144 808.7037 828.2405 837.6909 838.3161 883.0680 887.2717 898.4090 903.5460 931.8964 937.2606 939.6082 962.0179 969.3596 986.9107 988.5081 990.8411 996.4678 997.5936 1013.1612 1023.4133 1050.6586 1062.7063 1103.8652 1130.9535 1159.7011 1173.5575 1175.7013 1184.0659 1218.4787 1233.4762 1251.7465 1274.4842 1277.6997 1312.7488 1358.9816 1383.8998 1398.8173 1401.2325 1410.3910 1423.7627 1436.8494 1441.1049 1470.4143 1472.8385 1474.9327 1497.1797 1521.5825 1537.7897 1577.9317 1594.1334 1609.0794 1620.2929 1638.3861 2978.4916 3060.5759 3088.9419 3123.8960 3126.5704 3130.4776 3132.3022 3143.5919 3146.0555 3147.4593 3148.9927 3164.9121 3168.2767 3170.6020
redmass: 1.0256 4.1300 4.8377 5.1939 6.6892 6.6043 5.2606 6.1453 3.6660 6.3200 3.0739 5.6198 4.4003 4.2939 5.7218 7.0309 3.2625 3.2461 3.7559 2.5150 5.8175 6.5161 3.8996 5.7455 4.4284 7.1684 6.9034 4.3671 5.6340 6.9184 2.7673 2.7995 4.8648 1.3724 2.6581 1.5067 6.2092 1.3384 5.8961 1.5666 12.1695 10.9697 1.3491 5.6685 1.4187 1.5275 5.5997 1.4194 1.3816 6.2050 1.9618 1.3599 1.3568 2.7226 2.3117 1.5773 3.0219 1.5536 1.6885 1.4263 1.3722 1.3464 1.1215 2.0182 2.6571 1.7186 4.3853 1.7876 1.3609 1.8062 8.2076 1.2257 2.5930 5.7001 2.6525 4.8096 2.9422 1.4785 1.7803 1.0806 3.9120 5.2415 5.9440 7.3153 5.8537 5.7279 6.1298 6.7150 1.0386 1.0954 1.0998 1.0861 1.0880 1.0890 1.0888 1.0919 1.0948 1.0929 1.0924 1.1004 1.0959 1.0983
irintensity: 0.7594 0.2055 0.7457 0.5683 1.0409 0.2644 0.1043 1.6505 0.6101 0.0363 2.4568 0.1321 0.9139 1.4623 0.5214 0.7234 0.0115 4.5478 4.3740 23.3311 6.5312 0.0313 0.1490 2.1263 2.0679 4.6535 1.2789 0.0185 0.3433 5.7632 5.3720 32.2465 0.3603 66.2746 0.1971 31.8645 3.1091 46.9790 15.7692 22.0622 4.1581 39.6348 4.0551 13.3965 2.5421 14.4027 2.8761 11.7032 3.0406 0.0473 5.8766 0.0068 0.4802 1.7240 3.6026 16.4115 5.1712 11.1773 8.5423 6.0955 0.4161 0.8739 2.5541 5.5179 11.3971 8.2212 3.3152 8.2875 1.2539 8.4129 0.1023 13.5437 54.1528 18.1861 10.1794 29.1582 10.3641 73.2184 22.1777 18.9695 73.6355 28.2035 13.4771 0.5380 8.8281 5.2094 3.1452 2.9152 31.1700 20.5455 17.4459 2.2963 8.2494 0.6522 7.4871 7.0479 21.9417 7.1449 21.6223 44.5916 5.7713 11.4312
temp: 298.150 k
press: 1.00000 atm
elementType: 8 7 7 6 6 6 6 6 6 6 6 6 6 6 6 6 6 6 6 6 6 6 1 1 1 1 1 1 1 1 1 1 1 1 1 1
symmnumber: 1
zpe: 725442.7 jmol-1
zpe.correction: 0.276307 hartree
zpe.thermalcorrener: 0.293859 hartree
zpe.thermalcorrenthalpy: 0.294803 hartree
zpe.thermalcorrgfe: 0.227484 hartree
zpe.sumelectzpe: -915.650366 hartree
zpe.sumelectthermal: -915.632814 hartree
zpe.sumelectthermalent: -915.631870 hartree
zpe.sumelectthermalfe: -915.699189 hartree
dipole: -0.0542 4.1162 0.0511
dipole: 4.1169
quadrupole: -88.2293 -123.1268 -134.2565
quadrupole: 4.7633 0.2773 0.1255
quadrupole: 26.9749 -7.9226 -19.0523 4.7633 0.2773 0.1255
hfenergy: -915.926673 hartree
pointgroup: C01 [X(C19H14N2O1)]
dipole: -0.0538052 -1.6187138 -0.0170647 debye
polarizability: 480.6881732|-5.027653|226.8320286|0.1890218|-0.0750938|88.8907117 unknown
InChI: InChI=1S/C19H14N2O/c1-13-5-4-8-16(11-13)18-20-21-19(22-18)17-10-9-14-6-2-3-7-15(14)12-17/h2-12H,1H3
charge 0 multiplicity 1
36 atoms
O  1.032988 -0.069006 0.002765
N  0.218759 2.063493 -0.009125
N  1.649598 2.128716 -0.006911
C  -3.889671 0.424435 -0.003697
C  -4.043146 -1.018434 0.007565
C  -1.441297 0.159425 0.000725
C  -2.577404 0.986519 -0.006841
C  -2.864914 -1.83782 0.014863
C  -1.59373 -1.270855 0.011513
C  -0.11647 0.764888 -0.002028
C  3.479961 0.38959 0.001127
C  -5.064802 1.249386 -0.011262
C  -5.36225 -1.577203 0.010992
C  2.10249 0.866427 -0.001619
C  5.114552 -1.456952 0.009309
C  3.775626 -0.999044 0.005963
C  -6.337477 0.675564 -0.007745
C  -6.487672 -0.748763 0.003535
C  4.536497 1.341638 0.003383
C  6.157555 -0.494618 0.016104
C  5.86913 0.890872 0.011423
C  5.42427 -2.943611 -0.016797
H  -2.445922 2.074225 -0.015063
H  -2.978265 -2.928101 0.023244
H  -0.699853 -1.901589 0.017173
H  -4.946881 2.339235 -0.019789
H  -5.477407 -2.667578 0.019568
H  2.951999 -1.721678 0.007544
H  -7.228317 1.312754 -0.013558
H  4.294104 2.408751 0.002084
H  -7.492252 -1.185586 0.006259
H  7.200718 -0.832728 0.025898
H  6.688221 1.617909 0.01791
H  5.405719 -3.333448 -1.052906
H  6.425342 -3.155549 0.396886
H  4.684597 -3.522359 0.564011
