program: Gaussian 09
title: 000259798
version: EM64L-G09RevD.01
frameworkgroup: C1[X(C19H14N2O)]
method: RPBEPBE
basis: SDD
operation: Freq
keyword: #p
keyword: freq=noraman
keyword: PBEPBE/SDD
title: #p freq=noraman PBEPBE/SDD
converged: YES YES NO NO
title: Mulliken charges:
elementType: O N N C C C C C C C C C C C C C C C C C C C H H H H H H H H H H H H H H
charge: -0.274441 -0.124170 -0.130380 0.377501 0.383869 0.324218 -0.550928 0.178160 -0.409107 -0.388493 0.088996 0.354030 0.091305 -0.412509 -0.408344 -0.353037 -0.240721 -0.414253 -0.236520 -0.789502 -0.241126 -0.224420 0.280806 0.255484 0.240281 0.246351 0.241310 0.257534 0.235353 0.232353 0.231233 0.213232 0.250620 0.250078 0.233332 0.231907
chargesum: 0.00000
title: Mulliken charges with hydrogens summed into heavy atoms:
elementType: O N N C C C C C C C C C C C C C C C C C C C
charge: -0.274441 -0.124170 -0.130380 0.377501 0.383869 0.324218 -0.270122 0.178160 -0.168827 -0.133009 0.088996 0.354030 0.091305 -0.166158 -0.167033 -0.095503 -0.008368 -0.178901 -0.005287 -0.075572 -0.007794 0.007487
polarizability: 4.77920202e+02 -1.43748491e+01 2.27157047e+02 -7.17963318e-02 5.50600383e-02 8.83046667e+01
1716.lowfreq: -7.3957 -5.3510 -0.0007 0.0006 0.0010 2.7353 23.1199 28.2001 49.2527
frequency: 22.9649 28.1945 49.2438 74.0072 93.7062 146.5649 154.2203 177.8997 184.9244 188.6384 205.6935 279.9330 308.9822 343.2054 348.8667 368.7227 402.7079 444.5665 451.8105 478.8442 509.6484 512.6356 516.4856 523.0351 550.0806 590.8565 634.5889 640.2689 664.2765 670.5712 701.1477 730.1858 757.0307 763.1020 776.5332 790.3466 796.0132 832.0215 837.1164 878.7143 881.2555 883.1610 898.1866 931.5727 939.0077 950.3228 960.6873 969.1454 980.7423 986.1797 995.4215 995.8374 996.6498 1022.1378 1043.7095 1050.4675 1057.4018 1128.3853 1136.6138 1159.6524 1174.2423 1177.5588 1179.2944 1214.4540 1226.8172 1243.1695 1264.3187 1276.7382 1289.9908 1358.3953 1370.5840 1404.0784 1409.8849 1414.8739 1422.9503 1436.5000 1440.5650 1455.9579 1464.6967 1470.8418 1496.3390 1512.4555 1536.3200 1576.1034 1577.4421 1608.6687 1613.9873 1638.7579 2990.4142 3070.4644 3095.0478 3124.0618 3128.2675 3130.3729 3132.3048 3142.2375 3146.1790 3147.5110 3157.2118 3164.8891 3167.7752 3173.4359
redmass: 4.0273 5.4639 5.5995 6.4371 5.6191 5.6908 3.1237 1.2731 3.4158 5.1532 3.5955 4.6486 5.6432 5.3181 3.9035 7.7539 3.2616 4.1197 2.9918 2.5073 6.9151 3.7437 5.7620 3.9248 6.0735 7.1559 6.8920 4.3223 6.3298 5.6701 4.2049 2.0985 4.8575 1.3620 1.6660 2.6366 5.0432 6.5218 1.3399 1.3166 13.7374 1.5644 12.6751 5.9011 1.5409 8.5850 1.3819 1.4219 5.8036 1.3837 1.3394 1.6314 1.3588 2.3567 1.5798 2.2911 3.2874 1.7360 1.6331 1.3752 1.1581 1.7431 1.2981 2.5927 2.1413 1.9350 2.6195 1.7669 1.5281 1.8247 4.8223 1.5511 5.7649 1.6669 2.7168 4.7215 2.8383 1.0430 1.3103 2.2907 3.9387 5.3079 5.7596 6.8832 7.0305 5.7302 6.0676 6.7531 1.0367 1.0955 1.1013 1.0861 1.0860 1.0890 1.0887 1.0901 1.0947 1.0930 1.0949 1.1004 1.0960 1.0991
irintensity: 0.0000 1.2596 0.5477 0.8174 0.5557 0.3101 0.0410 1.7129 0.7056 0.2729 2.0367 0.1219 0.9361 0.7474 0.2702 1.3521 0.0115 2.5164 8.2382 22.3106 2.7381 0.5128 6.0671 0.5187 2.2518 3.4169 2.0687 0.0019 12.7819 2.7011 7.2851 27.9215 0.4119 81.7389 27.5755 0.0119 0.2140 6.8751 47.0262 0.0339 15.1197 24.0974 27.5412 10.3619 11.4911 13.9361 0.6944 11.3982 4.6029 2.9501 0.0068 0.5532 0.0099 4.1483 9.5548 9.2173 3.3087 3.0426 6.8037 7.1332 0.4254 2.0772 1.6791 12.6488 14.9624 2.1052 6.0405 8.9064 3.7704 8.3365 7.7250 13.4610 15.1412 42.3141 9.0071 28.0800 14.6026 13.8116 75.8165 32.4886 93.0789 25.6285 14.7589 3.5421 1.1412 4.7179 10.2966 3.3600 18.3135 7.9913 36.1890 2.4431 4.6971 0.5273 7.5411 14.5950 20.6490 8.0082 32.0918 44.0511 5.6006 17.7887
temp: 298.150 k
press: 1.00000 atm
elementType: 8 7 7 6 6 6 6 6 6 6 6 6 6 6 6 6 6 6 6 6 6 6 1 1 1 1 1 1 1 1 1 1 1 1 1 1
symmnumber: 1
zpe: 726259.2 jmol-1
zpe.correction: 0.276618 hartree
zpe.thermalcorrener: 0.293787 hartree
zpe.thermalcorrenthalpy: 0.294732 hartree
zpe.thermalcorrgfe: 0.230127 hartree
zpe.sumelectzpe: -915.648803 hartree
zpe.sumelectthermal: -915.631633 hartree
zpe.sumelectthermalent: -915.630689 hartree
zpe.sumelectthermalfe: -915.695293 hartree
dipole: 0.6809 3.0475 -0.0002
dipole: 3.1226
quadrupole: -91.7023 -120.4332 -134.3426
quadrupole: -2.9902 -0.0147 0.0262
quadrupole: 23.7904 -4.9405 -18.8499 -2.9902 -0.0147 0.0262
hfenergy: -915.9254202 hartree
pointgroup: C01 [X(C19H14N2O1)]
dipole: -0.2538678 1.1988355 0.0874371 debye
polarizability: 478.1137612|11.8687462|226.2264367|-5.6563845|9.3200327|89.0417175 unknown
InChI: InChI=1S/C19H14N2O/c1-13-6-2-5-9-17(13)19-21-20-18(22-19)16-11-10-14-7-3-4-8-15(14)12-16/h2-12H,1H3
charge 0 multiplicity 1
36 atoms
O  1.074847 0.346753 -0.068017
N  0.38987 -1.823483 -0.207807
N  1.822199 -1.803391 -0.229545
C  -3.806085 -0.446294 -0.040614
C  -4.048108 0.981279 0.058113
C  -1.379067 -0.029253 -0.054803
C  -2.461987 -0.923986 -0.095501
C  3.536509 0.08602 -0.125776
C  -2.922709 1.870881 0.097753
C  -1.619287 1.385596 0.043246
C  -0.019662 -0.550504 -0.112876
C  4.728313 -0.709866 -0.202681
C  2.207526 -0.518096 -0.146784
C  -4.928017 -1.341359 -0.080337
C  -5.398856 1.455273 0.112674
C  3.629946 1.505101 -0.025067
C  -6.233328 -0.849431 -0.025167
C  5.973196 -0.032424 -0.174444
C  -6.470896 0.559754 0.072003
C  4.707769 -2.220497 -0.310938
C  4.880507 2.146985 0.000746
C  6.061523 1.372807 -0.074435
H  -2.263966 -1.998985 -0.170119
H  -0.766165 2.069776 0.073956
H  -3.10289 2.949595 0.172205
H  -4.74322 -2.419358 -0.154681
H  -5.580698 2.533986 0.187036
H  2.709227 2.092985 0.032251
H  6.891542 -0.627864 -0.232506
H  -7.083235 -1.539586 -0.055973
H  -7.500317 0.931951 0.11422
H  5.735357 -2.619222 -0.353712
H  4.177683 -2.681677 0.541302
H  4.154336 -2.55604 -1.206084
H  4.935191 3.237787 0.078375
H  7.043151 1.858886 -0.055413
