program: Gaussian 09
title: 000259815
version: EM64L-G09RevD.01
frameworkgroup: C1[X(C11H15N5O5)]
method: RPBEPBE
basis: SDD
operation: Freq
keyword: #p
keyword: freq=noraman
keyword: PBEPBE/SDD
title: #p freq=noraman PBEPBE/SDD
converged: YES YES NO NO
title: Mulliken charges:
elementType: O O O O O N N N N N C C C C C C C C C C C H H H H H H H H H H H H H H H
charge: -0.268054 -0.451021 -0.486601 -0.450679 -0.239116 -0.226536 -0.107030 -0.236176 -0.051597 -0.609666 -0.181466 -0.064201 -0.229329 -0.016221 -0.371863 0.270047 0.205647 -0.107071 0.162344 -0.314529 -0.496015 0.259866 0.277076 0.262825 0.233644 0.204139 0.221996 0.348898 0.413231 0.377928 0.256466 0.244013 0.240897 0.245854 0.344276 0.338027
chargesum: 0.00000
title: Mulliken charges with hydrogens summed into heavy atoms:
elementType: O O O O O N N N N N C C C C C C C C C C C
charge: -0.268054 -0.102122 -0.073371 -0.072751 -0.239116 -0.226536 -0.107030 -0.236176 -0.051597 0.072637 0.078400 0.212874 0.033496 0.217423 0.054272 0.270047 0.205647 -0.107071 0.162344 -0.058064 0.234749
polarizability: 2.12010647e+02 -5.92820527e+00 1.99422088e+02 -7.59994141e+00 -5.62957108e+00 1.06284641e+02
1716.lowfreq: -13.7761 -8.8912 -4.7214 -0.0011 -0.0008 -0.0007 27.8289 37.0613 68.4789
frequency: 27.4596 36.8512 68.4676 84.4083 106.7228 112.3654 127.3868 133.2508 157.4001 165.3784 175.2196 202.9433 241.0089 251.9892 271.2371 288.5920 296.8390 315.1110 337.6541 361.6191 390.8085 412.3429 449.9197 469.8123 509.1631 519.5737 547.6458 569.3448 579.2399 580.3099 598.5164 650.7682 676.1319 692.8909 702.7047 712.2774 750.2936 769.9045 788.3032 801.7310 855.3383 882.8368 906.7248 918.5825 933.6434 946.6359 962.1310 984.5930 995.2056 1003.8197 1014.3771 1019.1882 1028.9745 1049.8761 1074.0690 1111.2721 1121.6269 1157.0582 1161.1043 1192.4197 1197.9138 1209.9696 1226.2236 1255.9613 1273.3942 1276.8199 1286.2569 1308.0272 1314.7562 1327.8467 1340.9333 1348.7976 1357.1152 1372.4959 1394.8980 1406.9040 1409.8961 1430.4574 1452.3985 1458.9037 1467.3118 1469.0859 1523.5042 1546.6730 1564.9076 1591.4650 1639.8869 2549.4810 2976.6059 3005.9035 3006.9211 3014.2285 3054.4058 3059.6768 3091.2187 3111.5373 3157.5719 3175.5946 3349.2072 3541.5669 3573.6626 3695.9772
redmass: 5.4539 5.2792 6.0910 3.7616 3.5615 4.5870 1.3379 4.2682 5.3233 4.4505 3.0220 6.2053 6.9811 5.6650 5.0692 4.4427 4.5713 1.2461 5.8913 4.5916 5.9079 5.3696 6.3062 6.4952 6.0222 1.2112 1.1148 3.9423 5.0886 4.4040 8.2885 9.9754 6.5082 10.0407 3.0390 6.2662 2.8056 1.5322 10.4627 4.8710 7.1963 7.0890 5.3896 1.4209 3.4203 2.4216 2.8264 3.8275 5.7047 1.7882 2.1814 2.2708 3.9458 2.5079 5.4250 2.6566 1.2465 1.4122 1.2796 1.2055 1.5663 3.1740 3.6135 1.2086 1.1940 2.0621 1.7304 1.3646 3.4911 1.4984 2.2514 1.3247 2.7292 1.9758 1.7827 1.2910 1.4383 2.7966 1.0507 2.5260 1.1400 1.0777 3.9778 1.8133 2.1935 1.7124 3.4785 1.0834 1.0674 1.0841 1.0299 1.0869 1.0859 1.0872 1.0978 1.1054 1.1051 1.0929 1.0653 1.0445 1.0663 1.1055
irintensity: 0.2243 0.9366 3.7188 2.9883 4.4356 4.5292 0.1727 4.4010 2.8860 8.0128 0.8639 3.5835 5.1155 6.3321 8.3871 11.7810 7.9485 158.7143 10.3600 2.7927 6.4638 2.1778 2.0474 3.5170 6.9821 253.9258 20.1103 2.6123 13.2323 0.2350 28.2224 25.5310 16.2542 7.7049 26.0796 28.5369 82.2877 49.1079 2.7482 9.1673 40.2297 18.5135 19.1760 27.2400 53.8200 23.7979 53.4197 125.9394 63.5716 170.4303 42.2210 35.8956 56.5529 29.4923 19.5060 9.0607 0.0517 14.0917 50.7304 23.9966 31.4136 10.1313 61.6264 3.3909 11.0557 32.4622 6.1961 12.9201 126.7766 1.5822 43.8135 29.4760 79.1492 72.8629 24.8410 135.1515 32.9220 103.2575 15.8080 13.4953 27.0999 3.6275 326.3897 9.9230 58.6042 81.3233 713.3285 2066.7584 42.6799 37.9743 42.7244 41.0280 13.2486 15.6660 46.4747 22.6245 13.3063 5.9678 91.5844 136.7272 10.8866 50.3664
temp: 298.150 k
press: 1.00000 atm
elementType: 8 8 8 8 8 7 7 7 7 7 6 6 6 6 6 6 6 6 6 6 6 1 1 1 1 1 1 1 1 1 1 1 1 1 1 1
symmnumber: 1
zpe: 724156.0 jmol-1
zpe.correction: 0.275816 hartree
zpe.thermalcorrener: 0.294906 hartree
zpe.thermalcorrenthalpy: 0.295850 hartree
zpe.thermalcorrgfe: 0.228239 hartree
zpe.sumelectzpe: -1076.449247 hartree
zpe.sumelectthermal: -1076.430157 hartree
zpe.sumelectthermalent: -1076.429213 hartree
zpe.sumelectthermalfe: -1076.496825 hartree
dipole: 6.4810 3.2275 1.7298
dipole: 7.4440
quadrupole: -113.5199 -120.6999 -121.5864
quadrupole: -6.9947 -11.4791 -0.0241
quadrupole: 5.0822 -2.0978 -2.9844 -6.9947 -11.4791 -0.0241
hfenergy: -1076.7250633 hartree
pointgroup: C01 [X(C11H15N5O5)]
dipole: -2.2805861 -1.7525507 0.5519442 debye
polarizability: 213.4360652|-2.0742105|189.9788129|-6.0683509|27.1023932|114.3024978 unknown
InChI: InChI=1S/C11H15N5O5/c1-20-11-15-5-8(12)13-3-14-9(5)16(11)10-7(19)6(18)4(2-17)21-10/h3-4,6-7,10,17-19H,2,12H2,1H3
charge 0 multiplicity 1
36 atoms
O  1.608584 -0.400483 -1.334561
O  2.880606 -2.327512 0.96006
O  2.492225 1.390525 1.18086
O  4.04149 2.378452 -0.840423
O  -1.203476 -2.935502 -0.757626
N  -0.275647 -0.89809 0.039769
N  -2.580976 -1.072736 -0.042289
N  -0.120891 1.434628 0.91873
N  -2.309058 2.45504 1.290623
N  -4.333586 1.321253 0.851594
C  2.102759 -1.079272 0.951373
C  1.122377 -1.254913 -0.244821
C  2.981005 0.154613 0.58805
C  2.950067 0.153053 -0.966018
C  3.078338 1.564931 -1.583378
C  -0.788696 0.326419 0.492938
C  -1.406747 -1.678602 -0.275188
C  -2.200568 0.197633 0.440937
C  -2.966093 1.320151 0.859473
C  -0.951764 2.456131 1.301825
C  -2.434706 -3.695224 -1.082695
H  1.582196 -0.922095 1.915724
H  1.119569 -2.31439 -0.554315
H  4.012385 0.027782 0.958763
H  3.723418 -0.541632 -1.347154
H  2.068442 2.024496 -1.592174
H  3.455345 1.512676 -2.616807
H  3.57256 -2.274305 1.666401
H  1.454914 1.472202 1.056791
H  3.655533 2.453985 0.082863
H  -0.465917 3.370298 1.652598
H  -3.05141 -3.816151 -0.176534
H  -2.070523 -4.663274 -1.452146
H  -3.012281 -3.161356 -1.855636
H  -4.842535 0.499769 0.532919
H  -4.827239 2.157102 1.158277
