program: Gaussian 09
title: 000259794
version: EM64L-G09RevD.01
frameworkgroup: C1[X(C10H18O3)]
method: RPBEPBE
basis: SDD
operation: Freq
keyword: #pfreq=noraman
keyword: PBEPBE/SDD
title: #p freq=noraman PBEPBE/SDD
converged: YES YES NO NO
title: Mulliken charges:
elementType: O O O C C C C C C C C C C H H H H H H H H H H H H H H H H H H
charge: -0.147804 -0.411831 -0.182827 -0.380040 -0.372099 -0.373990 -0.352992 -0.375623 -0.356474 -0.479135 -0.695872 0.134873 0.097412 0.194980 0.195063 0.189131 0.189145 0.191585 0.191581 0.188645 0.188834 0.218594 0.219881 0.194614 0.194720 0.258092 0.256068 0.215459 0.210095 0.210170 0.389748
chargesum: 0.00000
title: Mulliken charges with hydrogens summed into heavy atoms:
elementType: O O O C C C C C C C C C C
charge: -0.147804 -0.022083 -0.182827 0.010002 0.006176 0.009175 0.024487 0.062852 0.032860 0.035024 -0.060148 0.134873 0.097412
polarizability: 1.54970764e+02 -1.39748674e-01 1.12714739e+02 -2.81216780e-01 1.44891076e-01 8.49583012e+01
1716.lowfreq: -4.4742 -0.0004 0.0004 0.0011 6.8297 12.2022 22.2152 30.7121 38.7214
frequency: 20.7577 29.7440 38.7060 48.2671 70.5937 91.5495 104.7780 117.0987 140.9190 152.4695 172.9698 199.6207 225.1365 290.4576 339.0598 368.7306 371.7872 432.7982 462.2363 502.2438 598.4081 624.9973 667.5469 722.9129 726.8098 747.6295 782.0160 794.2153 856.5751 888.3095 931.4335 983.7249 1005.6040 1013.3907 1025.8180 1030.8785 1059.0299 1080.0305 1081.9903 1087.5709 1097.8384 1124.2503 1185.4984 1217.2883 1218.3721 1254.5836 1256.7068 1277.4842 1280.9088 1284.3517 1296.3991 1298.7100 1301.3458 1332.8509 1353.4042 1357.8077 1365.0504 1388.0290 1416.3116 1462.2769 1463.3813 1466.4969 1471.5327 1475.9698 1478.2954 1485.1643 1489.9964 1633.8406 1661.1147 2950.1252 2951.6399 2954.2834 2962.1034 2968.5361 2969.4035 2971.9658 2984.7196 2991.4597 2991.6711 3003.1695 3008.1488 3022.0598 3037.4986 3055.4624 3068.3081 3071.0589 3498.0455
redmass: 10.6086 4.1157 4.6330 1.9802 2.8131 1.7063 4.3838 2.1633 1.8990 2.0232 5.8868 3.9550 1.1318 4.9012 3.6502 3.4177 5.4417 4.5128 3.1531 4.0579 1.4356 4.6382 1.7824 1.0729 1.1101 1.2130 6.0857 1.3253 1.3465 1.8864 1.2899 5.1051 1.1744 5.2400 3.1976 2.9859 3.0740 2.2646 2.1467 2.1618 1.3792 2.9184 1.7771 1.4254 1.3050 1.2656 1.3804 1.7773 1.0956 1.0768 1.1009 1.1070 1.4786 1.4950 1.6106 1.6528 1.6983 1.2172 1.0936 1.0734 1.0694 1.0714 1.0761 1.0426 1.0776 1.0882 1.0950 9.9656 10.2686 1.0588 1.0588 1.0592 1.0592 1.0590 1.0618 1.0363 1.0966 1.0611 1.0976 1.1006 1.0968 1.1042 1.1045 1.1032 1.1007 1.0993 1.0642
irintensity: 0.2744 0.1470 1.0118 1.3109 0.5809 0.1578 1.1955 0.6018 0.0440 0.1460 1.3025 0.4587 0.0000 2.1665 3.5582 3.0678 3.7941 8.5159 3.0327 5.1903 53.5085 32.5176 123.2250 12.4192 2.0698 0.9481 4.6395 0.2665 1.8363 5.3561 0.0232 14.4512 0.9204 33.4660 190.1192 28.3520 15.2508 0.8349 0.9261 4.9660 0.1100 20.9663 0.1101 0.9649 23.2577 0.1055 8.7048 5.5090 0.0621 0.4921 0.0834 0.2385 14.6893 14.4922 2.5987 2.9645 9.9583 11.0845 41.6795 0.2215 0.1890 0.6861 1.6859 12.4480 3.7727 2.0387 29.1700 163.0437 92.4632 0.8125 5.1432 0.0906 25.5308 142.9481 17.2165 36.2271 0.6376 31.3824 2.3938 2.3773 0.6765 0.0087 87.8341 91.2148 99.4932 54.4081 22.5248
temp: 298.150 k
press: 1.00000 atm
elementType: 8 8 8 6 6 6 6 6 6 6 6 6 6 1 1 1 1 1 1 1 1 1 1 1 1 1 1 1 1 1 1
symmnumber: 1
zpe: 692301.3 jmol-1
zpe.correction: 0.263684 hartree
zpe.thermalcorrener: 0.279832 hartree
zpe.thermalcorrenthalpy: 0.280777 hartree
zpe.thermalcorrgfe: 0.216905 hartree
zpe.sumelectzpe: -616.475863 hartree
zpe.sumelectthermal: -616.459715 hartree
zpe.sumelectthermalent: -616.458771 hartree
zpe.sumelectthermalfe: -616.522642 hartree
dipole: -1.7981 3.8729 0.0417
dipole: 4.2701
quadrupole: -91.9730 -83.7132 -77.6455
quadrupole: 19.6257 0.3952 0.0038
quadrupole: -7.5291 0.7307 6.7984 19.6257 0.3952 0.0038
hfenergy: -616.739547 hartree
pointgroup: C01 [X(C10H18O3)]
dipole: 0.675237 -1.4953173 -0.3612498 debye
polarizability: 154.9450381|-0.9087662|111.1898852|-0.6234678|6.376962|86.5088816 unknown
InChI: InChI=1S/C10H18O3/c1-2-3-4-5-6-7-8-9(11)10(12)13/h12H,2-8H2,1H3
charge 0 multiplicity 1
31 atoms
O  -3.170589 1.846451 0.512776
O  -4.428965 -1.418961 -0.254753
O  -5.679028 0.504423 0.154192
C  1.941276 0.41505 0.126859
C  3.184995 -0.460271 -0.145717
C  0.607102 -0.336402 -0.079389
C  4.518918 0.290906 0.064738
C  -0.628926 0.551747 0.182314
C  5.764068 -0.582144 -0.21206
C  -1.948771 -0.215039 -0.013795
C  7.091897 0.177255 -0.001812
C  -3.187099 0.63197 0.208137
C  -4.574433 -0.055986 0.042424
H  1.96678 1.304576 -0.536795
H  1.986246 0.802788 1.165966
H  3.159047 -1.351848 0.515784
H  3.14215 -0.844905 -1.186473
H  0.567643 -0.731692 -1.116354
H  0.579372 -1.220947 0.59147
H  4.545573 1.184057 -0.594405
H  4.565242 0.673238 1.106065
H  -0.589418 0.958707 1.211339
H  -0.610419 1.430875 -0.490608
H  5.738053 -1.473385 0.44814
H  5.716263 -0.965255 -1.252045
H  -2.009963 -1.095292 0.659508
H  -2.013391 -0.653261 -1.03203
H  7.965851 -0.469725 -0.20183
H  7.176076 0.547441 1.037501
H  7.158425 1.053013 -0.674855
H  -5.326473 -1.840182 -0.354997
