program: Gaussian 09
title: 000259792
version: EM64L-G09RevD.01
frameworkgroup: C1[X(C6H13NO2S)]
method: RPBEPBE
basis: SDD
operation: Freq
keyword: #p
keyword: freq=noraman
keyword: PBEPBE/SDD
title: #p freq=noraman PBEPBE/SDD
converged: YES YES NO NO
title: Mulliken charges:
elementType: S O O N C C C C C C H H H H H H H H H H H H H
charge: -0.026418 -0.414518 -0.230841 -0.585039 -0.176902 -0.153584 -0.316920 -0.682106 -0.710644 0.157087 0.275319 0.223782 0.205736 0.241626 0.231861 0.228352 0.222472 0.203033 0.251554 0.096771 0.281754 0.298563 0.379062
chargesum: 0.00000
title: Mulliken charges with hydrogens summed into heavy atoms:
elementType: S O O N C C C C C C
charge: 0.070352 -0.035456 -0.230841 -0.004721 -0.176902 0.121735 0.112598 0.019733 -0.033584 0.157087
polarizability: 1.05663833e+02 3.06630141e+00 9.70075239e+01 8.46567309e+00 -3.79440975e+00 8.12111246e+01
1716.lowfreq: -7.0429 0.0021 0.0025 0.0028 13.0488 19.3887 36.9119 98.6291 117.1534
frequency: 36.7268 98.5565 117.0657 150.7638 203.3873 207.1725 221.8095 238.7396 251.6741 271.4271 295.4990 301.0927 340.6973 352.5384 373.2141 449.7133 494.8316 535.0574 599.6153 629.5500 645.7768 693.0210 780.8628 796.4449 809.9396 854.2408 880.6342 1007.5497 1032.5862 1049.6590 1055.6493 1105.9079 1124.0888 1159.0233 1176.0536 1197.4181 1254.1383 1280.7600 1310.1177 1345.7242 1380.3270 1391.5378 1400.2422 1449.1509 1466.8068 1478.1620 1480.5564 1494.5996 1610.3278 1663.1509 2430.2518 2967.4259 2983.5099 2991.2774 3031.3253 3036.6630 3068.4993 3087.9114 3093.9780 3095.8572 3448.9028 3498.3795 3584.3942
redmass: 6.5731 5.2288 2.1330 3.5245 1.5249 2.3674 1.4072 1.7016 1.8643 2.0774 2.1985 3.9436 3.3418 1.1441 3.1664 3.2261 3.3712 2.9182 1.5668 1.6730 2.3101 2.5632 2.2930 1.5923 1.3266 2.4285 2.2418 1.3461 1.9411 1.9460 2.9489 2.4014 1.7142 1.8810 2.4769 2.4199 1.6117 1.1965 1.2692 1.4960 1.6260 1.2013 1.2396 1.0757 1.0510 1.0478 1.0492 1.0445 1.3156 3.5713 1.0379 1.0632 1.0374 1.0355 1.0965 1.0853 1.0978 1.0991 1.0998 1.0995 1.0440 1.0637 1.0988
irintensity: 1.7070 0.3861 0.2799 0.7972 1.8882 7.3493 3.1923 1.5379 9.0881 4.1091 8.5612 0.6333 1.6394 42.7551 16.1509 4.5211 1.4044 83.9789 13.9772 295.7931 75.8076 95.2383 17.1591 8.7748 2.9720 6.3663 1.0719 8.4391 38.6145 54.3886 197.1271 3.1811 11.2347 2.9062 8.9633 7.2667 2.9353 2.9463 12.2385 5.4739 36.7939 19.6314 24.7353 4.1982 15.9116 6.9391 7.6845 10.8765 145.0834 126.4579 25.3190 27.1085 25.7272 18.7706 15.9667 18.5185 36.2199 16.1245 9.7733 35.8021 2.2071 24.2075 18.6735
temp: 298.150 k
press: 1.00000 atm
elementType: 16 8 8 7 6 6 6 6 6 6 1 1 1 1 1 1 1 1 1 1 1 1 1
symmnumber: 1
zpe: 489643.3 jmol-1
zpe.correction: 0.186495 hartree
zpe.thermalcorrener: 0.199202 hartree
zpe.thermalcorrenthalpy: 0.200146 hartree
zpe.thermalcorrgfe: 0.148342 hartree
zpe.sumelectzpe: -838.871456 hartree
zpe.sumelectthermal: -838.858750 hartree
zpe.sumelectthermalent: -838.857806 hartree
zpe.sumelectthermalfe: -838.909610 hartree
dipole: -0.0482 2.1415 0.5739
dipole: 2.2176
quadrupole: -72.2348 -67.1087 -70.5202
quadrupole: 4.8783 1.8823 -0.4087
quadrupole: -2.2802 2.8458 -0.5656 4.8783 1.8823 -0.4087
hfenergy: -839.0579516 hartree
pointgroup: C01[X(C6H13N1O2S1)]
dipole: -0.28056 0.7848639 0.2578467 debye
dipolederiv: -0.4004044 -0.0535319 -0.0431992 -0.0008466 -0.1179279 -0.1782587 -0.0381779 -0.248746 -0.1915344 -0.3463296 -0.0994207 0.1099488 -0.0936015 -1.1519006 0.2221468 0.0932736 0.1457707 -0.3477976 -0.7479218 0.1704396 -0.2506672 -0.0317178 -0.6556183 0.0612142 -0.321492 0.1918925 -0.5019488 -0.6299918 0.0909077 0.3001706 0.1340561 -0.4759026 -0.0811823 0.3689788 -0.1732832 -0.6005733 0.4563106 0.2576687 0.2292353 0.1120353 0.1214881 0.0638116 0.1416359 0.1165549 0.2025266 0.0030921 -0.2025121 -0.2290683 -0.3331829 0.2502579 0.0937501 -0.2644279 -0.0043474 0.1877701 -0.0041678 -0.0381103 -0.0280252 -0.001075 0.0463926 0.0126373 0.0035571 -0.0373408 -0.0067395 -0.0658157 0.016568 -0.0421773 -0.0123154 -0.0629696 0.0055041 0.0047257 0.0787118 -0.0860407 0.0553843 0.0704998 -0.0132062 0.0559758 -0.0704257 0.0706753 -0.0026258 0.0507522 -0.0011198 0.9180114 0.0045687 0.3216041 0.2433036 1.4507331 -0.2706621 0.571072 -0.2620239 0.4959692 0.023878 0.0517858 -0.0255056 0.0276904 -0.0245741 0.0582448 -0.0452931 0.0833776 -0.0247138 -0.0682943 0.0121191 0.1278864 -0.0151082 0.0315732 0.0442832 0.104497 0.0305594 -0.0197749 -0.0356361 -0.0408636 -0.1280628 -0.0476106 -0.018854 -0.0665473 -0.1297236 -0.0424575 -0.0302615 0.0074597 -0.0495668 -0.1080789 -0.0622068 0.0489759 -0.049935 -0.0922446 -0.0400474 0.0286455 -0.0512086 -0.0268335 0.1360818 0.0032348 0.1012373 0.0046285 0.0943915 0.0117612 0.0207845 0.0837777 0.0749576 -0.008145 0.0674156 -0.1004384 -0.0133206 -0.0042576 -0.0795765 0.0926277 0.0619399 0.0829728 0.0239441 0.0973705 -0.1281594 -0.0582065 0.0509004 -0.1052264 0.0519727 -0.0316025 -0.0561231 -0.1014058 -0.105795 0.0664409 -0.0757036 -0.1081306 -0.0222649 -0.0275092 -0.0165358 -0.0629071 0.0996372 -0.0337206 0.0972595 0.0201784 0.0865986 0.0381253 0.0044718 0.0783402 -0.0653937 -0.032075 -0.0100875 -0.0189127 0.1548934 -0.0738541 0.1254631 -0.0259216 0.2115563 -0.1086222 -0.1377518 -0.0383827 0.124235 -0.0262813 -0.10496 0.0831307 0.3485507 0.3020805 0.0034148 -0.0794429 0.0344393 0.1647651 0.0114899 -0.1521169 0.0980671 0.1546687 0.1960777 -0.0320177 -0.1216969 0.0101294 0.3223246 -0.0033602 -0.1823266 -0.0388524 0.2759477 unknown
polarizability: 101.7894574|4.3328748|99.5033488|10.9701245|0.3061133|82.5896755 unknown
InChI: InChI=1S/C6H13NO2S/c1-3-6(2,10)4(7)5(8)9/h4,8,10H,3,7H2,1-2H3
charge 0 multiplicity 1
23 atoms
S  -2.261161 -1.317968 -0.740741
O  1.594609 1.78376 -0.397505
O  2.405986 -0.120502 0.644554
N  0.894421 -1.584549 -1.244244
C  -0.866428 -0.362787 0.211735
C  0.384378 -0.293076 -0.777952
C  -1.385467 1.028367 0.664084
C  -0.575584 -1.251751 1.438511
C  -1.741371 2.053174 -0.434197
C  1.556897 0.41855 -0.100112
H  0.078626 0.319047 -1.644237
H  -2.272715 0.852949 1.302241
H  -0.609732 1.471316 1.323718
H  0.234621 -0.81016 2.046246
H  -1.476398 -1.342394 2.070013
H  -0.259807 -2.265836 1.138479
H  -2.123375 2.978822 0.033789
H  -2.537232 1.680027 -1.10575
H  -0.86229 2.32945 -1.040436
H  -2.447066 -0.372374 -1.737286
H  0.15891 -2.191516 -1.621068
H  1.519357 -2.047228 -0.576311
H  2.372218 2.200181 0.066667
