program: Gaussian 09
title: 000259779
version: EM64L-G09RevD.01
frameworkgroup: C1[X(C11H8N8)]
method: RPBEPBE
basis: SDD
operation: Freq
keyword: #pfreq=noraman
keyword: PBEPBE/SDD
title: #p freq=noraman PBEPBE/SDD
converged: NO YES NO NO
title: Mulliken charges:
elementType: N N N N N N N N C C C C C C C C C C C H H H H H H H H
charge: -0.143948 -0.009877 -0.366915 0.022024 -0.149378 0.027824 0.015343 -0.067857 0.243427 -0.599674 0.491779 -0.119838 0.270708 -0.172502 -0.381521 -0.379557 -0.225046 -0.226736 -0.226995 0.270100 0.239141 0.270898 0.223048 0.285983 0.233382 0.238789 0.237398
chargesum: 0.00000
title: Mulliken charges with hydrogens summed into heavy atoms:
elementType: N N N N N N N N C C C C C C C C C C C
charge: -0.143948 -0.009877 -0.366915 0.022024 -0.149378 0.027824 0.015343 -0.067857 0.243427 -0.090434 0.491779 -0.119838 0.270708 0.098396 -0.158473 -0.093574 0.008335 0.012053 0.010403
polarizability: 1.97233600e+02 1.92043234e+01 1.96517396e+02 3.13445622e+00 1.18580249e-01 1.03561431e+02
1716.lowfreq: -4.8262 -0.0003 0.0003 0.0006 3.1494 6.1014 24.7077 43.4368 53.4777
frequency: 24.4868 43.4334 53.4450 108.7789 138.3314 148.0973 197.0535 243.8688 299.1770 311.7232 349.6639 360.0988 405.2991 437.2811 466.4824 493.9054 516.7653 565.8947 574.8555 612.5727 616.9232 649.4764 652.3135 684.0177 689.0933 710.5382 734.5098 765.5088 783.1049 815.4841 832.4614 847.7136 862.6835 934.1875 940.0955 941.6479 962.3870 988.5214 990.7412 1009.5202 1010.8490 1027.8613 1035.7799 1086.8363 1098.8116 1126.5848 1152.7879 1174.3874 1177.3470 1195.9480 1212.2770 1243.4903 1275.1792 1303.1392 1323.5263 1336.2225 1351.5664 1371.9062 1385.7114 1398.4454 1445.6661 1448.8314 1475.7956 1488.8687 1596.4709 1613.9296 1655.7971 3028.9993 3092.0244 3115.2152 3125.8466 3138.3625 3152.5891 3168.8875 3242.7014
redmass: 4.8618 7.6575 4.8758 7.6740 8.9499 5.1175 6.9341 8.6975 6.8555 4.5141 5.8715 3.2922 2.8390 6.0474 5.6092 7.2102 7.6512 6.6527 8.5686 5.7964 6.2930 5.5455 13.7753 6.3222 11.7273 1.8573 3.6529 9.0952 3.0620 2.4903 1.7821 13.8308 1.2496 3.1456 1.7459 2.4013 8.6402 1.8900 2.8072 1.4336 7.5991 2.3231 6.8969 1.8910 7.2633 2.4177 3.3022 5.2526 1.0729 1.1742 2.6523 1.9519 9.7947 2.0012 9.1867 1.3311 1.5625 4.9687 7.6122 5.7964 2.1776 2.1688 1.6343 2.0320 6.0179 5.9108 11.1353 1.0597 1.1057 1.0887 1.0899 1.0900 1.0954 1.1013 1.0992
irintensity: 0.4237 0.2302 1.0709 1.3421 0.7069 1.8695 4.8988 2.5738 0.3185 2.3262 0.6562 1.0172 0.0632 1.8611 8.6993 11.9037 9.4342 4.3587 0.1315 5.7577 1.1357 16.5644 0.0359 26.3804 0.3070 80.6968 43.5533 1.0136 8.5034 14.5782 10.4084 36.7908 1.3935 14.7494 1.0810 7.1783 5.4473 0.5921 0.9858 1.5006 4.9507 4.3103 3.9075 14.9558 16.8819 2.1131 8.6314 84.5525 1.2728 2.2618 16.2770 2.2590 29.1373 13.4269 21.9066 1.7269 15.9940 7.8738 1.0397 8.8301 13.8652 48.5952 39.8882 18.5654 1.8992 0.9416 42.4047 18.3033 1.8397 10.3670 2.1577 4.2415 18.7834 23.4974 1.1911
temp: 298.150 k
press: 1.00000 atm
elementType: 7 7 7 7 7 7 7 7 6 6 6 6 6 6 6 6 6 6 6 1 1 1 1 1 1 1 1
symmnumber: 1
zpe: 495497.9 jmol-1
zpe.correction: 0.188725 hartree
zpe.thermalcorrener: 0.202516 hartree
zpe.thermalcorrenthalpy: 0.203461 hartree
zpe.thermalcorrgfe: 0.146372 hartree
zpe.sumelectzpe: -860.551401 hartree
zpe.sumelectthermal: -860.537610 hartree
zpe.sumelectthermalent: -860.536665 hartree
zpe.sumelectthermalfe: -860.593754 hartree
dipole: 7.3957 2.5418 2.2979
dipole: 8.1509
quadrupole: -117.9573 -121.0924 -108.2795
quadrupole: 1.7210 -8.7843 11.7411
quadrupole: -2.1809 -5.3160 7.4969 1.7210 -8.7843 11.7411
hfenergy: -860.7401261 hartree
pointgroup: C01 [X(C11H8N8)]
dipole: -2.9021241 0.9784217 -0.9508247 debye
polarizability: 197.0047373|-19.0552503|196.5638031|4.1104878|-3.96568|103.743887 unknown
InChI: InChI=1S/C11H8N8/c1-2-4-8(5-3-1)6-18-7-12-10-9(18)11-14-15-17-19(11)16-13-10/h1-5,7H,6H2
charge 0 multiplicity 1
27 atoms
N  -0.09982 1.248304 -0.822648
N  1.145318 2.872494 0.234626
N  2.756529 -0.828373 0.341789
N  3.004781 1.405884 0.974238
N  1.144215 -1.920876 -0.793106
N  3.537951 0.199777 1.006333
N  3.16878 -2.173831 0.273756
N  2.188334 -2.805845 -0.407549
C  1.016215 0.620072 -0.311551
C  -1.238199 0.60605 -1.54864
C  -2.303577 0.047689 -0.612308
C  1.786566 1.632283 0.340748
C  1.521036 -0.702371 -0.318169
C  0.026072 2.604426 -0.459763
C  -3.375846 0.866743 -0.17846
C  -2.224978 -1.29632 -0.167207
C  -4.35505 0.353529 0.700315
C  -3.20583 -1.808299 0.711347
C  -4.2699 -0.98554 1.147847
H  -0.807217 -0.193512 -2.174651
H  -1.659128 1.378872 -2.215115
H  -0.725124 3.341646 -0.734204
H  -3.45183 1.90374 -0.530353
H  -1.400063 -1.934887 -0.506485
H  -5.182526 0.990857 1.030157
H  -3.14107 -2.847579 1.050716
H  -5.030534 -1.385433 1.827235
