program: Gaussian 09
title: 000259778
version: EM64L-G09RevD.01
frameworkgroup: C1[X(C11H8N8)]
method: RPBEPBE
basis: SDD
operation: Freq
keyword: #pfreq=noraman
keyword: PBEPBE/SDD
title: #p freq=noraman PBEPBE/SDD
converged: YES YES NO NO
title: Mulliken charges:
elementType: N N N N N N N N C C C C C C C C C C C H H H H H H H H
charge: -0.120048 -0.020744 -0.361209 -0.049656 0.017852 -0.090135 0.008466 -0.064272 -0.582915 0.134992 -0.001663 0.496437 -0.177028 0.255432 -0.401635 -0.356382 -0.220255 -0.225355 -0.227129 0.265432 0.239968 0.279535 0.228266 0.262656 0.234174 0.237115 0.238098
chargesum: 0.00000
title: Mulliken charges with hydrogens summed into heavy atoms:
elementType: N N N N N N N N C C C C C C C C C C C
charge: -0.120048 -0.020744 -0.361209 -0.049656 0.017852 -0.090135 0.008466 -0.064272 -0.077515 0.134992 -0.001663 0.496437 0.102507 0.255432 -0.173369 -0.093726 0.013919 0.011760 0.010970
polarizability: 2.36646349e+02 2.61166988e+01 1.65977093e+02 1.89293495e+00 -5.83649906e+00 1.07006340e+02
1716.lowfreq: -7.0047 -0.0007 -0.0006 0.0004 2.8232 6.3322 13.9507 35.1851 39.1628
frequency: 13.0364 35.1633 39.1528 96.7161 159.4168 162.6809 191.8729 249.3579 279.4519 305.8013 355.2028 369.1781 403.4788 440.8943 472.2575 498.4392 551.4475 555.5556 588.8789 616.4001 635.6038 652.1202 653.2444 682.1963 688.9003 710.3369 744.9952 770.1145 785.2302 815.6181 833.9830 840.9298 859.5706 929.0943 939.0333 948.8704 967.3043 985.1370 990.2707 1001.2378 1005.6019 1027.0625 1066.9394 1086.8560 1105.1363 1130.0104 1141.4478 1177.0009 1180.1115 1192.4240 1211.0782 1233.6678 1267.8337 1316.6945 1329.6957 1334.8026 1343.7134 1363.4498 1386.2701 1418.1831 1443.8988 1456.7515 1478.9635 1488.5447 1596.8554 1613.6021 1615.9401 3032.8012 3093.9876 3116.5642 3127.9527 3139.3663 3152.9089 3169.1769 3241.0970
redmass: 5.4127 4.4333 8.1081 8.4158 6.7558 5.7140 6.2580 8.8118 9.5863 4.4291 3.0488 5.3077 2.8155 5.4115 6.7380 6.7190 6.9491 7.3865 7.2986 6.3385 4.8451 12.2064 9.1416 7.4065 7.0422 1.6539 4.4636 9.8011 3.3762 2.8373 13.5076 1.6524 1.2497 1.5765 4.2656 2.2345 10.7916 1.3892 6.2028 10.2192 1.3427 2.2588 6.6909 1.8097 7.2892 3.3537 5.9146 1.0611 1.9655 1.1275 2.8428 2.4262 9.5190 2.1789 4.1912 3.0000 1.5632 2.0265 6.7177 5.7803 2.1947 1.5762 2.3662 2.0868 6.0696 5.9994 11.9475 1.0594 1.1057 1.0888 1.0879 1.0906 1.0957 1.1015 1.0992
irintensity: 0.5111 0.9632 0.2578 0.3281 0.3898 0.5034 0.9780 5.4493 0.3453 1.1115 1.5592 3.4459 0.0893 0.5700 4.0587 10.8026 2.6666 0.9322 2.7682 0.1035 26.4002 1.3261 1.5041 26.7683 11.0727 109.6241 10.0951 2.3516 6.1731 11.7192 49.2854 10.2801 0.4660 2.2512 8.9843 16.4837 4.0223 0.3580 0.7145 2.7013 0.6213 5.8267 2.1876 6.9915 84.6956 8.5002 24.6550 0.1857 14.5948 0.9458 8.8439 15.4904 43.2556 37.8285 71.6321 24.7150 7.9896 19.7178 3.2935 70.4341 9.0019 17.7606 20.5294 29.8907 1.5794 2.1245 25.2332 19.2773 2.0608 9.5217 1.0884 5.9938 23.2374 19.3519 1.2756
temp: 298.150 k
press: 1.00000 atm
elementType: 7 7 7 7 7 7 7 7 6 6 6 6 6 6 6 6 6 6 6 1 1 1 1 1 1 1 1
symmnumber: 1
zpe: 495879.4 jmol-1
zpe.correction: 0.188870 hartree
zpe.thermalcorrener: 0.202661 hartree
zpe.thermalcorrenthalpy: 0.203605 hartree
zpe.thermalcorrgfe: 0.145520 hartree
zpe.sumelectzpe: -860.550651 hartree
zpe.sumelectthermal: -860.536860 hartree
zpe.sumelectthermalent: -860.535916 hartree
zpe.sumelectthermalfe: -860.594001 hartree
dipole: 9.7565 1.9470 2.2243
dipole: 10.1945
quadrupole: -129.5388 -109.6431 -111.2065
quadrupole: 1.8373 -11.1897 10.6661
quadrupole: -12.7427 7.1530 5.5897 1.8373 -11.1897 10.6661
hfenergy: -860.7395213 hartree
pointgroup: C01 [X(C11H8N8)]
dipole: -3.828454 -0.8441039 0.8468839 debye
polarizability: 235.1821996|27.9195819|167.8191172|-1.0785758|4.1726001|106.6284662 unknown
InChI: InChI=1S/C11H8N8/c1-2-4-8(5-3-1)6-18-7-12-9-10(18)14-16-19-11(9)13-15-17-19/h1-5,7H,6H2
charge 0 multiplicity 1
27 atoms
N  -0.429115 -1.095517 0.75753
N  1.129176 -2.218667 -0.511751
N  2.908862 0.998628 0.229292
N  0.804144 0.999221 1.194817
N  1.93087 1.679647 1.008962
N  4.030504 -0.511314 -1.0186
N  4.159458 1.585369 -0.063219
N  4.805638 0.663279 -0.805337
C  -1.706879 -0.762144 1.448781
C  0.680161 -0.255987 0.641951
C  1.631555 -0.977757 -0.144756
C  -2.743113 -0.145061 0.51678
C  -0.11002 -2.246419 0.044987
C  2.858668 -0.28997 -0.373669
C  -3.813941 -0.925561 0.016726
C  -2.640921 1.2196 0.144162
C  -4.769284 -0.353262 -0.853746
C  -3.594162 1.790684 -0.726711
C  -4.658912 1.005297 -1.228441
H  -1.441796 -0.064883 2.261664
H  -2.084544 -1.695149 1.900963
H  -0.798887 -3.083342 -0.046435
H  -3.908214 -1.978649 0.311278
H  -1.819447 1.829777 0.539075
H  -5.596336 -0.962112 -1.234531
H  -3.510455 2.845395 -1.009805
H  -5.399013 1.4503 -1.902367
