program: Gaussian 09
title: 000259777
version: EM64L-G09RevD.01
frameworkgroup: C1[X(C12H9N7)]
method: RPBEPBE
basis: SDD
operation: Freq
keyword: #pfreq=noraman
keyword: PBEPBE/SDD
title: #p freq=noraman PBEPBE/SDD
converged: NO YES NO NO
title: Mulliken charges:
elementType: N N N N N N N C C C C C C C C C C C C H H H H H H H H H
charge: -0.123154 -0.026555 -0.335240 -0.063780 0.005037 -0.071405 0.009790 -0.581185 0.121451 -0.040396 0.496757 -0.189701 0.280264 -0.406078 -0.356441 -0.220953 -0.226567 -0.290745 -0.229053 0.264247 0.236163 0.276207 0.227923 0.265754 0.232220 0.235250 0.274188 0.236003
chargesum: 0.00000
title: Mulliken charges with hydrogens summed into heavy atoms:
elementType: N N N N N N N C C C C C C C C C C C C
charge: -0.123154 -0.026555 -0.335240 -0.063780 0.005037 -0.071405 0.009790 -0.080775 0.121451 -0.040396 0.496757 0.086507 0.280264 -0.178155 -0.090687 0.011266 0.008683 -0.016556 0.006950
polarizability: 2.48251483e+02 2.76875759e+01 1.65914125e+02 4.94446035e+00 -4.37270429e+00 1.08949477e+02
1716.lowfreq: -8.2106 0.0003 0.0004 0.0007 4.6456 7.0637 14.6222 35.7085 39.9484
frequency: 12.4229 35.6493 39.9340 99.9691 158.5076 163.2544 195.0497 249.3659 281.6580 310.9448 358.6740 371.0477 403.4810 447.3629 474.7619 505.1775 548.5712 573.8278 589.4632 616.4748 633.6493 644.4055 655.8171 688.4589 694.6634 712.6648 764.4742 771.8321 799.1126 814.7640 836.8645 859.8796 865.7388 882.3145 928.9029 948.4430 982.9439 985.0447 990.5302 1004.7711 1009.4172 1027.4691 1064.8022 1084.9631 1124.5443 1142.4063 1171.5778 1176.1694 1180.6281 1192.2460 1210.9741 1219.0387 1231.9163 1269.4568 1307.5604 1317.3962 1334.9488 1346.8965 1363.8548 1372.9031 1387.0966 1428.2562 1444.0948 1458.2705 1479.0123 1488.5285 1597.4184 1614.5912 1640.6858 3028.4893 3089.3462 3117.0459 3128.4489 3139.0465 3152.4004 3168.6727 3238.0835 3252.3913
redmass: 5.2087 4.4262 7.1574 6.8000 7.1027 5.1712 5.8022 7.6547 8.8344 3.6545 4.1511 3.5599 2.8204 4.5525 8.0588 5.9284 6.5322 8.7868 6.6539 6.3410 4.4098 5.4257 8.6364 8.9013 5.0350 1.5529 9.6142 3.1769 6.6491 2.7732 1.6637 1.2487 1.3756 11.4007 1.5257 1.7564 9.0603 1.3886 6.2522 1.3245 6.0440 2.2500 10.9339 1.7163 2.4064 3.5930 3.9889 1.0648 2.0322 1.1282 2.8337 3.8900 2.4265 7.9548 6.2463 2.0174 1.9300 1.8690 1.9489 2.8509 6.5952 5.1876 2.2067 1.6165 2.4225 2.0870 6.0879 6.0081 11.8512 1.0594 1.1055 1.0885 1.0875 1.0910 1.0958 1.1015 1.0989 1.0990
irintensity: 0.2438 0.5000 0.0845 1.9196 0.5168 1.4265 1.3444 1.3886 0.5848 3.6219 0.4358 0.4882 0.1056 1.8897 0.9705 14.0618 0.7112 3.8376 0.2770 0.1305 36.0736 1.9214 7.4308 8.6931 3.7445 116.8298 2.6266 5.7921 2.9337 12.4556 9.9870 0.4352 17.9657 13.8371 0.5517 4.6747 6.7407 0.3397 0.3809 1.1030 21.3905 7.3749 109.4507 11.1811 24.8883 10.1730 27.2928 0.1078 17.4992 1.3926 8.7451 49.1100 2.6749 81.1023 109.3056 23.8978 4.0727 8.4035 18.2743 36.5706 2.4014 46.3375 8.7086 15.2968 21.2648 31.5186 1.4741 2.4934 39.1016 22.1041 2.5436 9.4691 0.4088 6.8256 24.7528 21.5574 0.6535 0.7628
temp: 298.150 k
press: 1.00000 atm
elementType: 7 7 7 7 7 7 7 6 6 6 6 6 6 6 6 6 6 6 6 1 1 1 1 1 1 1 1 1
symmnumber: 1
zpe: 531751.6 jmol-1
zpe.correction: 0.202533 hartree
zpe.thermalcorrener: 0.216281 hartree
zpe.thermalcorrenthalpy: 0.217226 hartree
zpe.thermalcorrgfe: 0.159243 hartree
zpe.sumelectzpe: -844.551384 hartree
zpe.sumelectthermal: -844.537636 hartree
zpe.sumelectthermalent: -844.536692 hartree
zpe.sumelectthermalfe: -844.594674 hartree
dipole: 6.0916 1.5040 0.9221
dipole: 6.3419
quadrupole: -103.9009 -113.0270 -111.5453
quadrupole: 4.7018 -2.8612 12.4039
quadrupole: 5.5902 -3.5359 -2.0542 4.7018 -2.8612 12.4039
hfenergy: -844.7539173 hartree
pointgroup: C01 [X(C12H9N7)]
dipole: -2.384433 0.6373683 -0.3657879 debye
polarizability: 246.9020041|-29.493984|167.6127726|4.9217211|2.2044709|108.6003078 unknown
InChI: InChI=1S/C12H9N7/c1-2-4-9(5-3-1)6-18-8-14-10-11-13-7-15-19(11)17-16-12(10)18/h1-5,7-8H,6H2
charge 0 multiplicity 1
28 atoms
N  -0.432071 1.104457 -0.746088
N  1.113494 2.242604 0.525668
N  2.913368 -0.983829 -0.214058
N  0.808771 -0.983397 -1.176726
N  1.941955 -1.662234 -0.988082
N  4.023753 0.552578 1.041657
N  4.14003 -1.579989 0.060381
C  -1.700953 0.761017 -1.443442
C  0.683841 0.270317 -0.625965
C  1.62829 1.000295 0.161645
C  -2.74346 0.144877 -0.51696
C  -0.121331 2.259968 -0.035269
C  2.858011 0.32575 0.396847
C  -3.840505 0.913243 -0.057389
C  -2.620909 -1.207971 -0.109016
C  -4.80173 0.341744 0.807115
C  -3.579717 -1.778183 0.7559
C  4.750198 -0.61141 0.808603
C  -4.671111 -1.004566 1.216684
H  -1.425914 0.057464 -2.248061
H  -2.081358 1.687808 -1.906856
H  -0.817175 3.091666 0.051582
H  -3.949391 1.957053 -0.378259
H  -1.777838 -1.808031 -0.472248
H  -5.648776 0.941893 1.156528
H  -3.479564 -2.823706 1.066434
H  5.75472 -0.765122 1.194905
H  -5.415528 -1.449093 1.886173
