program: Gaussian 09
title: 000259773
version: EM64L-G09RevD.01
frameworkgroup: C1[X(C14H8Br2N2O)]
method: RPBEPBE
basis: SDD
operation: Freq
keyword: #p
keyword: freq=noraman
keyword: PBEPBE/SDD
title: #p freq=noraman PBEPBE/SDD
converged: YES YES NO YES
title: Mulliken charges:
elementType: Br Br O N N C C C C C C C C C C C C C C H H H H H H H H
charge: 0.040158 0.034057 -0.265103 -0.121569 -0.125178 0.316941 0.298704 0.117847 0.126411 -0.308824 -0.293867 -0.361084 -0.344945 -0.189251 -0.182841 -0.165806 -0.220180 -0.222950 -0.228093 0.278364 0.297346 0.255460 0.275576 0.279422 0.235234 0.237282 0.236889
chargesum: 0.00000
title: Mulliken charges with hydrogens summed into heavy atoms:
elementType: Br Br O N N C C C C C C C C C C C C C C
charge: 0.040158 0.034057 -0.265103 -0.121569 -0.125178 0.316941 0.298704 0.117847 0.126411 -0.030460 0.003479 -0.105624 -0.069369 -0.189251 -0.182841 0.113615 0.015053 0.014332 0.008796
polarizability: 3.74554910e+02 -1.36696215e+01 2.36081140e+02 -3.35259436e-03 3.17236901e-02 6.98927828e+01
1716.lowfreq: -4.7204 -4.2719 -0.0006 -0.0006 -0.0002 0.9231 18.4922 35.6663 36.6243
frequency: 18.4517 35.6638 36.6083 80.9371 102.3280 103.1733 112.2288 149.5943 185.3199 195.6329 233.7789 245.9082 302.3800 320.7221 346.0568 396.7007 400.6163 419.7446 485.7806 509.2835 526.4674 534.2886 613.0417 662.7970 675.4398 678.9103 697.4442 704.4953 711.9206 742.9898 781.7475 859.4768 878.9549 884.1523 900.0930 903.6261 921.8422 943.8039 955.1193 971.7301 988.9274 990.8622 990.9372 1007.8153 1026.8598 1062.3107 1087.6366 1099.0783 1105.3574 1176.5996 1190.0017 1199.2810 1262.0052 1271.0319 1325.5394 1367.4026 1384.2111 1385.6573 1411.9752 1434.1502 1450.9075 1508.6511 1529.5295 1550.0813 1586.7720 1595.7186 1616.6078 3135.2146 3145.7328 3157.1398 3166.5522 3175.6669 3179.6891 3184.6883 3188.1502
redmass: 6.9968 4.7695 9.5511 10.6244 14.8005 7.1711 10.2365 5.8549 4.4533 11.4996 5.3865 11.3529 8.5421 6.4878 7.8092 8.4847 2.8207 6.2728 3.7919 5.2915 7.4963 5.7481 6.4755 6.2420 2.9951 6.8290 2.0477 3.7762 10.2456 10.3289 1.8950 1.2483 1.4958 14.1610 13.6273 1.4304 1.4399 1.4144 11.0573 7.0971 6.3957 7.9189 1.3857 1.3340 2.3579 3.8903 1.7203 1.9805 1.5894 1.0559 1.1572 3.9603 1.3517 3.0849 1.3639 6.9640 3.2556 8.2648 2.9726 2.5014 2.4626 7.8969 5.9046 7.7718 6.2286 6.8568 6.0217 1.0856 1.0887 1.0931 1.0967 1.1014 1.0935 1.0931 1.0939
irintensity: 1.0660 0.1369 0.3116 2.0339 0.0680 0.0625 0.2537 0.3280 0.0477 0.6350 0.0289 0.3755 2.2770 0.2278 4.3266 0.2066 0.0001 4.0851 2.6655 0.0003 2.8236 6.5804 0.0026 16.8100 0.6652 3.0019 31.4308 62.6270 92.1072 65.6795 41.2915 0.0965 24.9086 6.1854 37.5093 7.7187 12.0760 6.2562 2.2276 7.0415 1.3737 7.7390 0.0541 0.3312 12.1681 17.6556 6.8095 9.9502 10.4158 0.0795 11.7160 1.1244 1.9747 12.8446 0.9437 11.8119 93.4090 1.5032 65.4713 84.5857 64.8003 60.3858 44.5127 108.6366 1.0190 55.7506 9.1175 0.2738 7.1753 16.1626 11.8461 20.4728 3.0351 0.3969 1.0809
temp: 298.150 k
press: 1.00000 atm
elementType: 35 35 8 7 7 6 6 6 6 6 6 6 6 6 6 6 6 6 6 1 1 1 1 1 1 1 1
symmnumber: 1
zpe: 479511.1 jmol-1
zpe.correction: 0.182636 hartree
zpe.thermalcorrener: 0.198735 hartree
zpe.thermalcorrenthalpy: 0.199679 hartree
zpe.thermalcorrgfe: 0.134780 hartree
zpe.sumelectzpe: -748.608229 hartree
zpe.sumelectthermal: -748.592131 hartree
zpe.sumelectthermalent: -748.591186 hartree
zpe.sumelectthermalfe: -748.656085 hartree
dipole: -2.6075 2.9871 0.0035
dipole: 3.9651
quadrupole: -99.9744 -133.0373 -132.5475
quadrupole: -7.2142 -0.0119 -0.0027
quadrupole: 21.8787 -11.1842 -10.6944 -7.2142 -0.0119 -0.0027
hfenergy: -748.7908654 hartree
pointgroup: C01 [X(C14H8Br2N2O1)]
dipole: -1.0213942 -1.1791232 -0.0007343 debye
polarizability: 374.448742|14.1967834|236.187295|-0.0130753|-0.0568702|69.8927964 unknown
InChI: InChI=1S/C14H8Br2N2O/c15-11-6-10(7-12(16)8-11)14-18-17-13(19-14)9-4-2-1-3-5-9/h1-8H
charge 0 multiplicity 1
27 atoms
Br 5.797081 1.933993 -0.002302
Br 3.870376 -3.539768 0.001909
O  -0.536038 -0.176738 0.001448
N  0.134554 2.004564 0.000027
N  -1.296938 1.976535 0.001331
C  1.917454 0.223392 0.000323
C  -3.007025 0.118455 -0.000387
C  0.551044 0.732069 0.00053
C  -1.665582 0.686095 0.000009
C  2.172121 -1.173721 0.001108
C  2.991711 1.155033 -0.000716
C  -3.209326 -1.288291 -0.000607
C  -4.12659 0.996745 -0.000395
C  4.307379 0.665096 -0.000902
C  3.506951 -1.615561 0.000839
C  4.596242 -0.71861 -0.000148
C  -4.519641 -1.808262 -0.000923
C  -5.430988 0.467002 -0.000742
C  -5.632648 -0.934793 -0.001004
H  1.342015 -1.883808 0.001894
H  2.774743 2.226265 -0.001336
H  -2.345548 -1.960533 -0.000538
H  -3.954062 2.077624 -0.000157
H  5.626716 -1.080549 -0.000331
H  -4.673444 -2.892436 -0.001107
H  -6.291379 1.144373 -0.000783
H  -6.649379 -1.342274 -0.001241
