program: Gaussian 09
title: 000259768
version: EM64L-G09RevD.01
frameworkgroup: C1[X(C18H11ClN2O)]
method: RPBEPBE
basis: SDD
operation: Freq
keyword: #p
keyword: freq=noraman
keyword: PBEPBE/SDD
title: #p freq=noraman PBEPBE/SDD
converged: NO YES NO NO
title: Mulliken charges:
elementType: Cl O N N C C C C C C C C C C C C C C C C C C H H H H H H H H H H H
charge: -0.055526 -0.267087 -0.124221 -0.125584 0.376912 0.383584 0.328805 -0.548465 -0.407544 -0.387880 0.096475 -0.411019 -0.407276 0.120327 0.322033 -0.240031 -0.235237 -0.336929 -0.360242 -0.085402 -0.203969 -0.230389 0.281120 0.241898 0.256924 0.246915 0.242388 0.233405 0.232303 0.280530 0.279890 0.241123 0.262169
chargesum: 0.00000
title: Mulliken charges with hydrogens summed into heavy atoms:
elementType: Cl O N N C C C C C C C C C C C C C C C C C C
charge: -0.055526 -0.267087 -0.124221 -0.125584 0.376912 0.383584 0.328805 -0.267344 -0.165645 -0.130956 0.096475 -0.164104 -0.164888 0.120327 0.322033 -0.006626 -0.002934 -0.056399 -0.080352 -0.085402 0.037154 0.031780
polarizability: 4.78552000e+02 -8.55976897e+00 2.33133617e+02 -9.36706447e-03 -8.06861240e-03 8.16762625e+01
1716.lowfreq: -2.6877 0.0006 0.0017 0.0017 4.6985 4.8558 21.0180 31.0078 39.5814
frequency: 20.8195 31.0066 39.5599 75.6010 94.2120 107.2690 169.6990 184.3477 187.0923 202.8114 245.7046 266.0005 320.6290 338.8169 360.2242 391.7832 402.6411 434.7662 440.5906 479.6605 510.4995 514.4250 519.6357 537.0323 589.6571 634.4371 640.2336 653.0824 670.1893 687.4041 709.7535 743.1646 757.4337 763.6924 790.4207 801.5090 831.4726 837.6633 883.7585 884.9453 899.1506 900.5947 924.3956 931.6388 939.9427 962.9347 970.1559 982.4031 987.2218 994.1682 997.3547 999.6726 1022.9163 1059.7727 1074.8806 1101.7417 1131.7561 1160.5974 1175.0274 1179.0382 1184.9714 1229.0820 1246.8723 1264.5345 1277.7279 1296.7810 1358.9492 1378.0922 1401.9457 1410.3017 1423.5996 1436.4467 1440.8604 1449.2010 1496.6847 1520.5497 1537.0445 1572.0840 1577.5283 1608.7782 1611.7400 1638.3680 3124.7242 3131.0802 3133.7147 3146.5432 3147.5621 3149.4396 3165.4073 3168.7864 3170.4325 3178.1573 3181.8780
redmass: 5.1141 5.8193 8.6792 7.0388 7.0560 8.0092 6.5298 3.7017 4.9891 7.0282 8.5027 5.6840 5.5912 5.8007 10.4821 8.5901 3.2635 3.1152 5.5065 2.5170 7.0671 3.9399 6.7987 5.7965 7.1996 6.9073 4.2504 7.2360 6.1577 2.5044 3.6119 8.7213 4.8714 1.3760 2.6658 1.4461 6.5321 1.3407 1.5595 13.5710 13.5621 1.4566 1.3884 5.6354 1.5326 8.9615 1.4190 6.4276 1.3837 1.3522 1.3612 5.4029 2.3350 3.2509 1.9894 1.6905 1.7043 1.4077 1.0861 1.0944 2.3938 2.2528 1.7535 2.4200 1.7644 1.5634 1.8135 6.6576 3.1914 5.7013 2.6470 4.2965 3.1482 2.5843 3.9905 6.1383 5.8807 7.0012 7.3043 5.7238 6.5540 6.7273 1.0861 1.0890 1.0889 1.0942 1.0936 1.0877 1.1005 1.0961 1.0933 1.0937 1.0985
irintensity: 0.0672 2.0391 0.4207 1.4056 0.5455 0.6723 1.2791 0.6231 0.0540 0.3874 0.4258 0.1469 0.2816 0.4608 1.8815 1.3365 0.0114 4.7341 6.7322 23.5684 1.5458 0.0565 6.4595 2.4612 4.1007 0.9931 0.0321 4.3210 0.1652 14.8584 25.0858 76.3808 0.3972 66.9594 0.2736 38.5389 6.9370 45.5078 19.6873 4.3752 37.0221 19.4702 1.8946 9.8547 12.1469 4.5299 11.3856 8.9652 3.1534 1.1612 0.0049 7.3733 3.6090 11.9522 13.0776 9.4549 6.9373 8.6563 0.0841 1.7049 9.1002 16.2538 1.1919 10.5672 9.3464 1.4390 7.3675 3.5912 49.9352 22.1042 12.9595 43.7357 15.1869 79.4862 101.0119 22.2939 32.4150 28.6564 0.7798 12.5182 13.6209 7.5323 2.3021 0.2542 6.8911 14.3061 13.3022 9.9098 43.1741 5.3079 0.2735 1.0299 6.3075
temp: 298.150 k
press: 1.00000 atm
elementType: 17 8 7 7 6 6 6 6 6 6 6 6 6 6 6 6 6 6 6 6 6 6 1 1 1 1 1 1 1 1 1 1 1
symmnumber: 1
zpe: 629288.8 jmol-1
zpe.correction: 0.239683 hartree
zpe.thermalcorrener: 0.256565 hartree
zpe.thermalcorrenthalpy: 0.257509 hartree
zpe.thermalcorrgfe: 0.192703 hartree
zpe.sumelectzpe: -1335.809668 hartree
zpe.sumelectthermal: -1335.792787 hartree
zpe.sumelectthermalent: -1335.791843 hartree
zpe.sumelectthermalfe: -1335.856649 hartree
dipole: -1.3532 1.6830 0.0005
dipole: 2.1596
quadrupole: -98.4345 -134.3492 -139.6411
quadrupole: -11.5990 -0.0009 -0.0037
quadrupole: 25.7071 -10.2076 -15.4995 -11.5990 -0.0009 -0.0037
hfenergy: -1336.0493515 hartree
pointgroup: C01 [X(C18H11Cl1N2O1)]
dipole: 0.5736098 0.6267848 -0.0003335 debye
polarizability: 478.641669|-7.1592842|233.0439425|-0.0034466|-0.0303479|81.6762679 unknown
InChI: InChI=1S/C18H11ClN2O/c19-16-7-3-6-14(11-16)17-20-21-18(22-17)15-9-8-12-4-1-2-5-13(12)10-15/h1-11H
charge 0 multiplicity 1
33 atoms
Cl -5.545401 3.133444 -0.000922
O  -1.066054 0.052706 0.000556
N  -0.232397 -2.072853 0.00068
N  -1.661241 -2.150426 0.001107
C  3.860681 -0.400261 0.000142
C  4.00255 1.043814 0.000006
C  1.410779 -0.153271 0.000392
C  2.552958 -0.972379 0.000323
C  2.818146 1.854542 0.000069
C  1.5513 1.278352 0.00026
C  0.09209 -0.770251 0.000577
C  5.041854 -1.216551 0.000077
C  5.317171 1.612813 -0.000188
C  -2.123785 -0.892758 0.000423
C  -3.506254 -0.431168 0.00018
C  6.309932 -0.632794 -0.000113
C  6.448778 0.792747 -0.000246
C  -3.806535 0.957997 -0.000212
C  -4.556988 -1.389783 0.000385
C  -5.154367 1.351943 -0.000411
C  -5.896764 -0.957788 0.000165
C  -6.212856 0.422552 -0.000235
H  2.430127 -2.061132 0.000411
H  2.923195 2.945585 -0.000031
H  0.653208 1.903041 0.000312
H  4.932291 -2.307279 0.000175
H  5.424082 2.703982 -0.00029
H  7.205826 -1.262789 -0.000162
H  7.449934 1.237282 -0.000394
H  -3.003383 1.699366 -0.000357
H  -4.304069 -2.454083 0.000705
H  -6.707831 -1.692833 0.000311
H  -7.25168 0.764032 -0.000398
