program: Gaussian 09
title: 000259757
version: EM64L-G09RevD.01
frameworkgroup: C1[X(C15H10ClNO)]
method: RPBEPBE
basis: SDD
operation: Freq
keyword: #p
keyword: freq=noraman
keyword: PBEPBE/SDD
title: #p freq=noraman PBEPBE/SDD
converged: YES YES NO NO
title: Mulliken charges:
elementType: Cl O N C C C C C C C C C C C C C C C H H H H H H H H H H
charge: -0.058086 -0.282090 -0.079926 0.290566 0.311826 0.338158 0.080515 -0.429420 -0.332541 -0.369577 -0.360552 -0.373125 -0.091907 -0.203200 -0.234386 -0.226699 -0.233209 -0.239688 0.262400 0.295450 0.258848 0.229289 0.256648 0.235445 0.230894 0.230669 0.259987 0.233713
chargesum: 0.00000
title: Mulliken charges with hydrogens summed into heavy atoms:
elementType: Cl O N C C C C C C C C C C C C C C C
charge: -0.058086 -0.282090 -0.079926 0.290566 0.311826 0.338158 0.080515 -0.167021 -0.037091 -0.110729 -0.131263 -0.116477 -0.091907 0.032246 -0.003492 0.003970 0.026777 -0.005975
polarizability: 3.75141273e+02 -3.93241974e-01 1.86864447e+02 -1.73497340e-03 -3.93736757e-04 6.75482422e+01
1716.lowfreq: -2.5650 -0.0021 -0.0019 -0.0006 1.4083 4.9710 26.0204 33.4851 54.1899
frequency: 25.8810 33.3849 54.1833 93.7629 115.7329 130.7927 183.8161 207.3697 235.4751 293.3386 313.2823 375.8670 396.6151 399.9005 408.2029 437.0987 491.7099 517.4652 539.6820 614.6475 650.6473 655.6290 675.8774 681.4015 695.1804 706.2906 742.7553 775.4108 796.1359 837.7315 852.5936 880.9097 909.4884 915.5944 920.4829 927.1895 980.9836 981.2980 984.7490 987.6180 1000.0433 1004.3320 1028.8442 1039.4849 1072.5438 1081.1886 1085.2877 1121.4519 1175.6424 1178.3698 1193.0928 1232.3201 1266.7536 1283.7561 1284.1982 1327.1355 1379.2160 1382.8224 1422.7611 1437.4545 1440.8901 1468.7470 1537.2163 1559.8082 1570.5154 1585.6083 1611.0708 1618.6557 3129.6478 3137.0824 3146.2574 3149.6015 3161.1177 3169.6464 3172.5073 3175.5824 3180.5569 3245.5034
redmass: 6.8730 4.3720 6.6657 5.8575 5.3787 7.7412 5.2408 6.4406 5.3687 6.9704 5.2095 9.0989 7.2484 2.8089 6.6587 3.1298 3.5388 6.1269 5.4949 6.4676 7.1538 3.2067 6.7189 3.2612 1.9196 3.3942 8.4710 1.7826 1.4915 1.4544 1.2700 11.0169 1.3621 8.2260 1.4663 1.4407 1.3850 6.4158 1.3472 6.1882 1.3254 6.7215 4.6996 2.4018 1.9751 1.6480 1.6785 2.1439 1.0560 1.0879 1.1304 4.1673 3.2296 1.8406 1.4765 1.3924 7.8753 7.7587 3.0958 2.4044 2.3889 2.2862 8.0812 6.1389 6.7451 6.3029 6.6170 6.1178 1.0851 1.0880 1.0875 1.0934 1.0961 1.0927 1.1008 1.0934 1.0988 1.0985
irintensity: 0.0097 0.2089 0.0596 0.7503 0.1357 0.2350 0.0082 0.0834 0.0111 1.5954 1.0621 3.8741 0.2195 0.0000 4.1852 4.5709 6.4597 2.2890 5.3309 0.0488 5.7587 4.8776 1.4169 6.8289 25.9593 57.3792 87.6943 59.6431 50.5199 23.0845 3.1035 10.2958 1.7428 17.0164 14.9755 8.4579 0.0045 5.5478 0.6369 0.1723 0.2750 6.2060 9.0457 0.2076 22.5652 0.2748 11.8435 26.4390 0.2658 0.3391 1.0216 4.1484 10.6430 3.1771 1.0606 0.4750 1.0226 0.1122 25.2395 31.1112 55.2625 55.7600 14.1906 7.6035 55.5306 3.3596 26.0704 9.6735 4.1729 1.2621 8.6976 22.5305 27.2013 1.2308 18.5536 0.0664 8.5809 11.1014
temp: 298.150 k
press: 1.00000 atm
elementType: 17 8 7 6 6 6 6 6 6 6 6 6 6 6 6 6 6 6 1 1 1 1 1 1 1 1 1 1
symmnumber: 1
zpe: 541207.9 jmol-1
zpe.correction: 0.206135 hartree
zpe.thermalcorrener: 0.220442 hartree
zpe.thermalcorrenthalpy: 0.221386 hartree
zpe.thermalcorrgfe: 0.162615 hartree
zpe.sumelectzpe: -1166.400913 hartree
zpe.sumelectthermal: -1166.386607 hartree
zpe.sumelectthermalent: -1166.385662 hartree
zpe.sumelectthermalfe: -1166.444434 hartree
dipole: 3.4196 2.1893 0.0004
dipole: 4.0603
quadrupole: -100.3867 -99.1174 -117.0905
quadrupole: -9.9585 -0.0004 -0.0007
quadrupole: 5.1448 6.4141 -11.5590 -9.9585 -0.0004 -0.0007
hfenergy: -1166.6070483 hartree
pointgroup: C01 [X(C15H10Cl1N1O1)]
dipole: -1.3129613 0.9099524 -0.0003878 debye
polarizability: 374.9181993|-6.4887959|187.0875143|0.0025043|-0.0281934|67.5482488 unknown
InChI: InChI=1S/C15H10ClNO/c16-13-8-4-7-12(9-13)15-17-10-14(18-15)11-5-2-1-3-6-11/h1-10H
charge 0 multiplicity 1
28 atoms
Cl 6.027423 -1.140607 0.000639
O  -0.368461 0.23404 0.000053
N  0.514672 -1.879158 0.000743
C  -1.450455 -0.686197 0.000274
C  -2.810189 -0.159735 0.000231
C  2.103298 0.08165 0.000073
C  0.802333 -0.574612 0.000151
C  -0.886265 -1.960721 0.000224
C  3.272149 -0.730423 0.000359
C  2.222383 1.498256 -0.000241
C  -3.920731 -1.051243 0.000574
C  -3.05198 1.242814 -0.000206
C  4.525999 -0.10346 0.000293
C  3.499863 2.094152 -0.000288
C  -5.236687 -0.549827 0.000488
C  -4.371777 1.73792 -0.00029
C  4.670295 1.299483 -0.000027
C  -5.470335 0.846662 0.000054
H  -1.387542 -2.924349 0.000256
H  3.171894 -1.819223 0.000618
H  1.319522 2.115578 -0.000443
H  -3.75355 -2.134066 0.000925
H  -2.201716 1.93172 -0.000483
H  3.594653 3.184917 -0.000531
H  -6.081967 -1.246562 0.00076
H  -4.544546 2.819644 -0.000626
H  5.663855 1.756317 -0.000065
H  -6.495037 1.233431 -0.000016
