program: Gaussian 09
title: 000259754
version: EM64L-G09RevD.01
frameworkgroup: C1[X(C14H8Br2N2O)]
method: RPBEPBE
basis: SDD
operation: Freq
keyword: #p
keyword: freq=noraman
keyword: PBEPBE/SDD
title: #p freq=noraman PBEPBE/SDD
converged: YES YES NO NO
title: Mulliken charges:
elementType: Br Br O N N C C C C C C C C C C C C C C H H H H H H H H
charge: 0.032921 0.032921 -0.267328 -0.124729 -0.124727 0.320374 0.320378 0.114891 0.114887 -0.355778 -0.355780 -0.341299 -0.341298 -0.173273 -0.173273 -0.180792 -0.180793 -0.216980 -0.216981 0.261157 0.261157 0.281578 0.281578 0.256731 0.256731 0.258863 0.258864
chargesum: 0.00000
title: Mulliken charges with hydrogens summed into heavy atoms:
elementType: Br Br O N N C C C C C C C C C C C C C C
charge: 0.032921 0.032921 -0.267328 -0.124729 -0.124727 0.320374 0.320378 0.114891 0.114887 -0.094622 -0.094623 -0.059721 -0.059719 0.083458 0.083458 0.078071 0.078071 -0.216980 -0.216981
polarizability: 4.63733363e+02 -1.51976066e-02 1.88146743e+02 -1.10926785e-02 -4.23577256e-03 6.99797089e+01
1716.lowfreq: -6.7541 -6.0135 -1.4116 -0.0009 -0.0007 -0.0005 26.3818 29.3236 36.0735
frequency: 26.3755 29.3236 36.0698 56.3453 76.6297 108.6791 135.2297 145.8112 199.5817 219.6610 243.1008 254.6898 305.8550 364.3135 369.5561 405.2360 405.5943 420.9246 469.5822 494.9939 507.9645 514.5714 620.6168 621.1906 659.8502 684.8250 697.3255 714.2418 721.3052 730.7496 835.1667 837.7385 846.1329 849.1126 883.9503 897.3373 951.4393 969.0681 970.6739 972.9209 986.9249 987.2264 994.9462 1002.4525 1044.2423 1059.3189 1063.6435 1112.4690 1113.8864 1187.2056 1189.9927 1199.3379 1267.7866 1297.1344 1298.2716 1363.4567 1369.7356 1400.2658 1402.2481 1434.2945 1442.4850 1514.8117 1527.9828 1569.7984 1573.0935 1603.6741 1604.3223 3158.1993 3158.4453 3159.3368 3159.3664 3176.9909 3177.0611 3180.5368 3180.6110
redmass: 5.8203 16.0642 3.7193 9.0236 8.4594 9.2311 9.9113 18.3128 8.1096 7.7983 19.9280 5.5981 7.2222 7.3692 6.1836 2.8901 2.8867 7.0259 8.2566 3.2132 3.3322 7.9184 7.1808 7.1320 8.5674 6.4350 7.3383 7.3120 3.7040 3.8026 1.3191 1.2858 1.4348 1.5169 14.1806 13.5188 11.1662 9.4609 1.3590 1.3633 1.3654 1.3663 5.3303 4.6955 7.8023 2.5439 2.2029 1.3919 1.4303 1.1714 1.1206 3.9769 4.4601 1.2619 1.3094 5.4047 6.6575 3.7202 3.5259 2.6427 2.4761 5.8029 6.9826 7.8039 7.8907 6.1586 6.0946 1.0888 1.0887 1.0893 1.0893 1.0968 1.0968 1.0980 1.0980
irintensity: 0.2250 0.0000 0.0000 0.0000 3.4184 0.9312 0.0609 0.1282 0.0000 0.9333 6.3244 0.3082 2.7054 0.0000 0.0223 0.0000 0.0078 8.5873 36.1007 42.6341 0.0000 0.0007 0.3031 1.3595 0.0000 23.3572 2.2784 11.6931 0.0000 16.8574 0.0000 16.3278 0.0000 108.8188 8.2766 30.2337 5.9501 95.5371 0.0000 1.6832 0.0000 1.0280 5.9100 66.6040 10.1691 91.1018 2.3148 0.0155 11.1228 6.4559 0.1044 22.1966 1.7441 0.4250 0.2390 5.3966 0.0030 36.4701 14.2931 342.0437 45.3426 0.0016 0.0000 0.8179 1.1182 19.8671 141.6569 3.3207 0.1419 1.6138 0.2941 1.7948 5.5882 2.4560 0.5682
temp: 298.150 k
press: 1.00000 atm
elementType: 35 35 8 7 7 6 6 6 6 6 6 6 6 6 6 6 6 6 6 1 1 1 1 1 1 1 1
symmnumber: 1
zpe: 479794.0 jmol-1
zpe.correction: 0.182744 hartree
zpe.thermalcorrener: 0.198781 hartree
zpe.thermalcorrenthalpy: 0.199725 hartree
zpe.thermalcorrgfe: 0.134842 hartree
zpe.sumelectzpe: -748.611269 hartree
zpe.sumelectthermal: -748.595232 hartree
zpe.sumelectthermalent: -748.594288 hartree
zpe.sumelectthermalfe: -748.659171 hartree
dipole: 0.0000 -2.3709 -0.0001
dipole: 2.3709
quadrupole: -130.1542 -128.1284 -132.5735
quadrupole: 0.0000 -0.0021 -0.0013
quadrupole: 0.1312 2.1569 -2.2881 0.0000 -0.0021 -0.0013
hfenergy: -748.794013 hartree
pointgroup: C01[X(C14H8Br2N2O1)]
dipole: -0.0002075 0.9327834 -0.0001732 debye
polarizability: 463.7333442|0.0732657|188.1467537|0.0119128|-0.0316695|69.9797173 unknown
InChI: InChI=1S/C14H8Br2N2O/c15-11-5-1-9(2-6-11)13-17-18-14(19-13)10-3-7-12(16)8-4-10/h1-8H
charge 0 multiplicity 1
27 atoms
Br 6.923838 1.431657 -0.000218
Br -6.925241 1.428734 -0.000276
O  -0.000412 0.090222 -0.000229
N  0.716092 -2.077922 0.001171
N  -0.716016 -2.078221 -0.000246
C  2.461173 -0.256784 -0.000092
C  -2.461861 -0.257809 0.00025
C  1.108919 -0.796103 0.000006
C  -1.109386 -0.796572 0.000347
C  2.695384 1.144121 -0.001004
C  -2.696664 1.142998 0.000362
C  3.564849 -1.153813 0.000833
C  -3.565156 -1.155307 -0.00007
C  4.012331 1.646173 -0.001037
C  -4.013825 1.64449 0.000204
C  4.882694 -0.659308 0.000763
C  -4.88321 -0.661363 -0.000188
C  5.092525 0.737941 -0.000168
C  -5.093633 0.735798 -0.000055
H  1.849482 1.838046 -0.001683
H  -1.851056 1.837281 0.000569
H  3.376871 -2.231851 0.001577
H  -3.376721 -2.233265 -0.000204
H  4.193227 2.724372 -0.00174
H  -4.195181 2.722612 0.000291
H  5.7316 -1.348358 0.00145
H  -5.731825 -1.350771 -0.000409
