program: Gaussian 09
title: 000259753
version: EM64L-G09RevD.01
frameworkgroup: C1[X(C10H18O2)]
method: RPBEPBE
basis: SDD
operation: Freq
keyword: #pfreq=noraman
keyword: PBEPBE/SDD
title: #p freq=noraman PBEPBE/SDD
converged: YES YES NO NO
title: Mulliken charges:
elementType: O O C C C C C C C C C C H H H H H H H H H H H H H H H H H H
charge: -0.466253 -0.248755 -0.392744 -0.393372 -0.391156 -0.387907 -0.393126 -0.405694 -0.374609 -0.114556 -0.512856 0.157279 0.188299 0.207400 0.209370 0.221178 0.191592 0.192268 0.186588 0.231201 0.192888 0.229434 0.187241 0.228987 0.197525 0.215299 0.212150 0.229325 0.240931 0.362075
chargesum: 0.00000
title: Mulliken charges with hydrogens summed into heavy atoms:
elementType: O O C C C C C C C C C C
charge: -0.104178 -0.248755 0.002955 0.037176 -0.007296 0.029882 0.029196 0.010535 0.038214 0.097594 -0.042600 0.157279
polarizability: 1.19040992e+02 -4.99962537e+00 1.09202211e+02 -6.79690766e-01 1.00564428e+00 9.90177565e+01
1716.lowfreq: -16.5376 0.0001 0.0003 0.0005 9.7527 18.3362 75.9280 106.1587 152.9103
frequency: 75.8665 106.1425 152.8990 165.6623 172.5117 204.2337 233.7580 269.8113 288.8507 312.1438 329.0796 359.5278 415.5560 424.4572 460.5514 491.3738 512.5215 590.3654 651.7661 703.0013 722.7855 757.5066 783.1524 793.0760 846.4264 875.7490 893.0118 924.4685 948.0396 962.8138 1009.2847 1018.6298 1052.2613 1071.8928 1099.7385 1101.2609 1109.4227 1118.3994 1137.5278 1174.5889 1180.4040 1202.5552 1211.9239 1250.7913 1259.6731 1273.8737 1284.5589 1291.7029 1307.9137 1340.6630 1347.2699 1349.6169 1352.4292 1354.4846 1362.6805 1363.8934 1376.6596 1438.4318 1455.5694 1461.3854 1463.2786 1464.7274 1480.0588 1484.1659 1494.4276 1591.6157 2884.2378 2953.8651 2960.5005 2974.3692 2977.5450 2981.3635 2984.9013 2989.8404 2999.9084 3003.7498 3030.1140 3034.6867 3038.2777 3047.2199 3051.3856 3055.8420 3074.7741 3390.3110
redmass: 4.8124 4.5481 3.4674 2.8412 2.6741 2.7409 2.8885 2.1544 2.4572 2.2094 2.7319 2.7804 2.4401 2.4961 1.4829 1.7635 2.2287 3.2616 2.6490 1.3602 1.8155 1.9761 2.1797 2.0133 2.1498 2.4266 2.3548 1.9628 2.1476 2.0579 2.4904 1.8301 2.0652 2.1830 2.0440 1.9907 1.4681 2.1161 1.3949 1.7321 1.3329 1.3337 1.2015 1.2587 1.3364 1.3138 1.1839 1.1804 1.2327 1.4173 1.3678 1.4478 1.4104 1.3792 1.4060 1.3735 1.4643 1.0966 1.0924 1.0805 1.0877 1.0859 1.0727 1.0794 1.0985 7.5557 1.0799 1.0605 1.0682 1.0639 1.0646 1.0650 1.0657 1.0653 1.0621 1.0986 1.0927 1.0962 1.0978 1.0973 1.0990 1.0986 1.0890 1.0638
irintensity: 1.7852 0.8382 0.3059 1.4081 1.0238 0.2982 2.4844 2.7551 3.5510 0.6263 13.8366 23.3219 7.9633 1.1983 52.3203 32.3216 25.4274 6.1836 0.6773 9.7172 10.8018 9.6288 8.8716 0.8598 3.6907 10.7475 1.5620 3.7578 19.1038 3.1668 54.6408 6.8651 15.2349 4.3781 19.3341 38.0272 1.5614 9.7168 1.6918 17.6266 3.5866 0.2946 12.8234 24.7189 4.8446 9.7504 2.8576 0.1318 9.8929 21.1130 29.7461 5.3088 1.5635 2.0599 3.0554 5.8187 28.3670 9.6844 13.1344 15.2649 7.0134 13.6654 4.2264 9.5334 44.1740 59.8045 39.1503 34.4243 12.9672 27.9193 38.5668 26.6786 55.8729 43.1794 28.3199 18.3151 23.2317 13.0978 42.5489 59.7095 55.9997 70.3668 35.9335 36.2944
temp: 298.150 k
press: 1.00000 atm
elementType: 8 8 6 6 6 6 6 6 6 6 6 6 1 1 1 1 1 1 1 1 1 1 1 1 1 1 1 1 1 1
symmnumber: 1
zpe: 695017.0 jmol-1
zpe.correction: 0.264718 hartree
zpe.thermalcorrener: 0.276891 hartree
zpe.thermalcorrenthalpy: 0.277835 hartree
zpe.thermalcorrgfe: 0.227624 hartree
zpe.sumelectzpe: -541.318362 hartree
zpe.sumelectthermal: -541.306189 hartree
zpe.sumelectthermalent: -541.305245 hartree
zpe.sumelectthermalfe: -541.355456 hartree
dipole: 2.2222 0.6423 2.5718
dipole: 3.4590
quadrupole: -81.3517 -74.4392 -73.1875
quadrupole: -0.9398 -2.4714 -4.0918
quadrupole: -5.0256 1.8869 3.1387 -0.9398 -2.4714 -4.0918
hfenergy: -541.58308 hartree
pointgroup: C01[X(C10H18O2)]
dipole: -0.8940639 0.2406595 -0.9973786 debye
polarizability: 118.7554608|5.2418476|109.4885891|-0.8638101|-0.9824919|99.0169087 unknown
InChI: InChI=1S/C10H18O2/c11-9-7-5-3-1-2-4-6-8-10(9)12/h9,11H,1-8H2
charge 0 multiplicity 1
30 atoms
O  2.876405 -0.472089 0.590781
O  0.64155 -1.813086 1.026055
C  -1.32659 1.723606 -0.295089
C  -0.141295 1.736787 0.705074
C  -2.569439 0.922096 0.181841
C  1.241608 2.028801 0.070218
C  -2.338176 -0.552625 0.610983
C  1.72341 1.012745 -0.994285
C  -1.893777 -1.572656 -0.471442
C  1.921308 -0.449835 -0.503748
C  -0.483473 -1.389211 -1.101898
C  0.651379 -1.234754 -0.101923
H  -0.992149 1.324298 -1.270116
H  -1.639427 2.767674 -0.500028
H  -0.337721 2.494588 1.490104
H  -0.083409 0.772928 1.242268
H  -3.336702 0.950137 -0.62007
H  -3.015404 1.450359 1.050387
H  1.22662 3.031194 -0.404969
H  2.00226 2.067363 0.872413
H  -3.298914 -0.926821 1.019687
H  -1.625825 -0.598325 1.455556
H  1.053667 1.006608 -1.876373
H  2.712368 1.344035 -1.364174
H  -2.629482 -1.577435 -1.301099
H  -1.929922 -2.577298 -0.008825
H  2.34099 -1.01997 -1.368907
H  -0.462519 -0.555082 -1.822342
H  -0.251795 -2.300507 -1.695984
H  2.484052 -1.063328 1.297407
