program: Gaussian 09
title: 000259762
version: EM64L-G09RevD.01
frameworkgroup: C1[X(C18H10Br2N2O)]
method: RPBEPBE
basis: SDD
operation: Freq
keyword: #p
keyword: freq=noraman
keyword: PBEPBE/SDD
title: #p freq=noraman PBEPBE/SDD
converged: NO YES NO NO
title: Mulliken charges:
elementType: Br Br O N N C C C C C C C C C C C C C C C C C C H H H H H H H H H H
charge: 0.039728 0.033919 -0.272153 -0.157688 -0.119503 0.207555 0.189621 0.390366 0.129898 -0.373040 -0.358974 -0.438642 -0.433547 -0.241702 0.115607 0.309375 -0.259098 -0.241254 -0.308538 -0.293066 -0.190294 -0.183801 -0.165844 0.258782 0.321140 0.245006 0.240211 0.235972 0.234211 0.232754 0.277307 0.296588 0.279104
chargesum: 0.00000
title: Mulliken charges with hydrogens summed into heavy atoms:
elementType: Br Br O N N C C C C C C C C C C C C C C C C C C
charge: 0.039728 0.033919 -0.272153 -0.157688 -0.119503 0.207555 0.189621 0.390366 0.129898 -0.114258 -0.037834 -0.193636 -0.193336 -0.005730 0.115607 0.309375 -0.024888 -0.008500 -0.031230 0.003522 -0.190294 -0.183801 0.113260
polarizability: 4.65504213e+02 2.45728264e+00 3.02518901e+02 3.01531327e-02 2.56652445e-01 8.55915220e+01
1716.lowfreq: -7.1974 -1.6649 -0.0004 -0.0004 0.0003 3.1790 10.9285 22.8037 34.4775
frequency: 9.9762 22.7872 34.4675 77.5266 85.0120 98.3090 111.0081 137.6109 163.3680 171.8073 180.8248 185.7757 243.5300 245.4906 293.3047 325.1962 332.5477 350.2409 391.8262 423.3263 439.6507 471.1711 496.1633 509.5533 525.8630 528.3192 548.8619 558.3191 633.1168 654.9690 665.5887 682.5555 709.9527 712.1923 739.9967 756.2297 788.0207 788.4656 805.8222 829.6202 877.6708 879.5449 897.3820 903.0311 904.0853 922.5965 930.4092 936.0443 965.8473 975.2094 978.9090 995.6298 1019.0020 1028.6502 1041.0614 1083.4588 1099.5035 1101.7979 1116.3890 1154.4847 1176.8843 1185.4023 1217.7583 1238.6344 1261.4981 1270.7461 1284.5114 1367.7431 1375.2647 1384.4605 1397.5237 1413.0841 1414.8682 1441.5960 1447.6654 1491.5943 1513.7685 1520.6464 1550.7190 1584.2553 1591.7943 1595.3401 1630.7459 3125.7144 3130.7732 3139.3423 3154.4733 3155.9955 3166.7271 3174.8158 3180.3821 3183.5702 3185.7179
redmass: 6.1655 9.2132 11.4262 11.5063 5.7299 18.3692 8.8124 6.7573 12.2552 4.6819 4.1135 4.4705 14.1499 4.8448 9.0204 6.1780 7.5242 6.8644 8.5141 3.4511 4.9850 3.2325 6.8204 5.2887 7.2316 5.0533 3.9959 7.2455 3.7884 6.5636 4.5166 3.2606 4.4069 10.2316 10.1402 1.4544 5.4615 1.7583 5.9356 1.7434 1.5013 13.7221 1.5525 1.4428 13.5725 1.4378 7.2064 1.4340 10.7160 6.5788 1.3651 1.3962 1.3166 3.0259 4.9820 2.2262 2.1070 1.6354 2.7892 1.4626 1.3588 1.3562 1.8578 1.9425 1.3201 2.9224 1.7134 7.0763 2.1362 3.2539 3.1715 3.1633 6.3721 2.5633 2.1484 6.5093 8.9985 4.2546 7.8105 6.9623 5.2727 6.8100 6.3401 1.0865 1.0879 1.0902 1.0927 1.0948 1.1004 1.0972 1.0932 1.0930 1.0942
irintensity: 0.1006 0.8649 0.1458 1.6642 0.4505 0.1377 0.4847 0.0229 0.9227 2.2735 0.6336 0.0035 0.4024 0.7974 2.4339 0.0556 4.5507 2.0050 0.2220 4.4058 3.3710 0.5485 1.1859 0.0038 1.9463 13.8644 5.4544 5.5014 0.0631 5.1166 6.8367 13.0318 11.8046 88.4905 64.9635 1.0060 0.5653 83.8188 8.3662 62.5833 24.5376 22.0873 0.1660 9.7365 39.2706 12.8943 1.5446 0.0058 0.9651 16.1911 1.5327 3.1525 1.8416 13.2471 3.1449 15.3868 14.6194 6.7974 16.2295 2.9655 1.2691 3.7529 2.0526 5.4683 1.4275 10.2258 16.1030 4.8013 85.9427 84.6409 19.4395 73.1725 16.8458 28.6896 3.3973 141.4505 52.0263 60.5456 116.4354 37.3618 1.9462 54.2794 3.9421 0.5190 1.6204 24.4439 16.6684 5.5633 52.5328 9.5047 2.8403 1.0193 0.5705
temp: 298.150 k
press: 1.00000 atm
elementType: 35 35 8 7 7 6 6 6 6 6 6 6 6 6 6 6 6 6 6 6 6 6 6 1 1 1 1 1 1 1 1 1 1
symmnumber: 1
zpe: 601082.2 jmol-1
zpe.correction: 0.228940 hartree
zpe.thermalcorrener: 0.247650 hartree
zpe.thermalcorrenthalpy: 0.248595 hartree
zpe.thermalcorrgfe: 0.177588 hartree
zpe.sumelectzpe: -901.993245 hartree
zpe.sumelectthermal: -901.974535 hartree
zpe.sumelectthermalent: -901.973591 hartree
zpe.sumelectthermalfe: -902.044597 hartree
dipole: 2.5001 2.8990 0.0103
dipole: 3.8282
quadrupole: -122.7747 -147.4249 -156.9207
quadrupole: 5.7597 0.0330 0.0335
quadrupole: 19.5987 -5.0514 -14.5473 5.7597 0.0330 0.0335
hfenergy: -902.2221853 hartree
pointgroup: C01 [X(C18H10Br2N2O1)]
dipole: -1.0874145 0.2793171 -1.0039355 debye
polarizability: 463.3710939|-16.9957524|96.5042086|-17.2662878|-45.0964902|293.7393333 unknown
InChI: InChI=1S/C18H10Br2N2O/c19-13-8-12(9-14(20)10-13)17-21-22-18(23-17)16-7-3-5-11-4-1-2-6-15(11)16/h1-10H
charge 0 multiplicity 1
33 atoms
Br 6.779892 -0.658402 1.674693
Br 4.969708 0.641255 -3.683743
O  0.505344 0.163643 -0.438208
N  -0.301493 -0.254157 1.652961
N  1.12621 -0.341746 1.695817
C  -3.197907 0.153234 0.530123
C  -1.961179 0.251825 -0.226867
C  -4.44691 0.374554 -0.176695
C  -0.653985 0.044527 0.389503
C  -1.999558 0.554881 -1.603953
C  -3.253272 -0.149333 1.931735
C  -4.435609 0.679549 -1.576524
C  -5.688143 0.28519 0.536734
C  -3.231799 0.76858 -2.278288
C  1.567279 -0.094452 0.457089
C  2.942624 -0.063853 -0.027471
C  -4.480783 -0.228708 2.596041
C  -5.709674 -0.011028 1.899392
C  3.2259 0.226114 -1.388345
C  3.995603 -0.329318 0.89022
C  5.319619 -0.297999 0.423626
C  4.567546 0.244993 -1.80916
C  5.635995 -0.013264 -0.924264
H  -1.061492 0.625619 -2.16148
H  -2.318227 -0.317094 2.472449
H  -5.391171 0.842138 -2.088892
H  -6.622076 0.455271 -0.011811
H  -3.226864 1.002514 -3.347488
H  -4.501003 -0.46157 3.666305
H  -6.661422 -0.077763 2.437286
H  2.411548 0.42959 -2.087344
H  3.757006 -0.550994 1.933603
H  6.672395 0.006006 -1.268649
