program: Gaussian 09
title: 000259745
version: EM64L-G09RevD.01
frameworkgroup: C1[X(C11H15NO2)]
method: RPBEPBE
basis: SDD
operation: Freq
keyword: #p
keyword: freq=noraman
keyword: PBEPBE/SDD
title: #p freq=noraman PBEPBE/SDD
converged: YES YES NO NO
title: Mulliken charges:
elementType: O O N C C C C C C C C C C C H H H H H H H H H H H H H H H
charge: -0.333731 -0.275906 -0.463407 0.073033 -0.375554 -0.705847 -0.688193 0.259893 0.478100 -0.444807 -0.357739 -0.195911 -0.210480 -0.258085 0.227006 0.208527 0.195248 0.216898 0.252463 0.212421 0.232426 0.210152 0.215394 0.326542 0.221642 0.299961 0.225789 0.225824 0.228340
chargesum: 0.00000
title: Mulliken charges with hydrogens summed into heavy atoms:
elementType: O O N C C C C C C C C C C C
charge: -0.333731 -0.275906 -0.136865 0.300039 0.028222 -0.024065 -0.030220 0.259893 0.478100 -0.223165 -0.057779 0.029878 0.015344 -0.029745
polarizability: 2.01651673e+02 4.67226261e+00 1.19119640e+02 3.50893635e+00 -1.75372131e+01 8.84896464e+01
1716.lowfreq: -0.0007 0.0005 0.0008 2.5160 4.6101 10.4559 35.7817 40.0174 77.6853
frequency: 34.5199 39.9032 77.6739 83.0195 93.9757 114.1435 181.0324 212.6569 214.1386 239.6566 248.0322 296.2489 342.0365 380.7853 408.6183 420.4026 476.9524 509.7603 584.6062 613.8487 639.8811 696.4200 700.2890 702.0083 752.9835 765.9384 803.7903 841.1972 849.0579 874.6952 913.1150 965.3796 970.9751 977.5868 985.4867 996.1236 998.1131 1029.0785 1039.8366 1089.5361 1111.6486 1129.5220 1159.2210 1172.1723 1182.5402 1189.2639 1257.9075 1266.1811 1295.7313 1323.7683 1336.6224 1359.6292 1385.9214 1387.0893 1389.5069 1432.7924 1452.9879 1465.9963 1476.0846 1480.1375 1485.5838 1487.7655 1515.6105 1600.3124 1617.4480 1658.0655 2982.4395 2985.4662 2990.0206 3016.4973 3041.2641 3076.5298 3085.3249 3091.6186 3101.0325 3112.7692 3131.6237 3143.8420 3164.9343 3189.6522 3542.2731
redmass: 3.3439 4.0947 6.9594 3.9625 3.1253 2.4780 2.2254 1.1783 1.9230 1.8244 4.1078 4.3594 6.2858 3.2017 2.9276 2.8166 2.9226 2.8321 5.5576 6.3412 1.2705 2.1688 4.3528 5.0217 2.4953 1.6778 1.7213 1.2658 2.3994 3.4382 1.4311 1.4544 1.3531 2.8477 4.4737 1.3037 1.9095 2.1129 3.2824 1.5598 1.8455 2.2766 3.0129 1.0506 1.9863 1.1156 1.9095 1.3088 1.2939 1.3832 1.2368 1.7031 3.9714 1.3282 1.2883 2.3596 1.0749 1.0610 1.0447 1.0448 2.2162 1.0551 2.2801 5.3483 6.0334 8.4193 1.0385 1.0517 1.0423 1.0869 1.0992 1.0997 1.0986 1.0999 1.1007 1.0883 1.0869 1.0935 1.0996 1.0952 1.0759
irintensity: 0.2642 0.9174 4.0539 0.2342 1.0494 0.6773 0.5570 0.8690 5.3591 7.8012 2.3217 2.1438 2.3450 8.0518 0.0081 0.9565 2.5084 26.2283 1.7748 1.5096 31.6359 17.6262 45.8107 24.6208 3.0295 104.2891 18.3390 0.3739 9.1073 7.0961 13.8930 19.0592 0.0618 77.3803 1.7002 2.4572 228.4177 2.2124 33.9253 35.9502 83.4356 37.9839 401.6971 0.5069 13.0130 7.2317 4.4077 1.0692 4.7357 61.2880 5.8990 4.2595 54.0970 13.4472 27.1501 113.8646 3.4698 8.2879 6.3127 14.4049 11.9177 17.6625 523.9933 30.5073 105.7892 209.7300 35.4569 9.5050 40.3321 6.2020 15.2970 42.5129 28.8333 64.4367 22.7354 14.1369 0.7600 32.0837 23.7418 6.2874 26.9918
temp: 298.150 k
press: 1.00000 atm
elementType: 8 8 7 6 6 6 6 6 6 6 6 6 6 6 1 1 1 1 1 1 1 1 1 1 1 1 1 1 1
symmnumber: 1
zpe: 630661.1 jmol-1
zpe.correction: 0.240206 hartree
zpe.thermalcorrener: 0.254489 hartree
zpe.thermalcorrenthalpy: 0.255433 hartree
zpe.thermalcorrgfe: 0.197948 hartree
zpe.sumelectzpe: -632.338178 hartree
zpe.sumelectthermal: -632.323896 hartree
zpe.sumelectthermalent: -632.322952 hartree
zpe.sumelectthermalfe: -632.380437 hartree
dipole: -1.0936 1.7928 -1.2181
dipole: 2.4277
quadrupole: -69.6038 -82.3008 -85.8402
quadrupole: 1.8338 0.2699 -2.7657
quadrupole: 9.6445 -3.0525 -6.5919 1.8338 0.2699 -2.7657
hfenergy: -632.5783846 hartree
pointgroup: C01 [X(C11H15N1O2)]
dipole: -0.4324987 -0.7640753 0.3760425 debye
polarizability: 200.5316067|-6.7923237|124.4022056|-10.8704065|-10.9131083|84.3271473 unknown
InChI: InChI=1S/C11H15NO2/c1-3-9(2)14-11(13)12-10-7-5-4-6-8-10/h4-9,12H,3H2,1-2H3
charge 0 multiplicity 1
29 atoms
O  -1.943384 -0.283113 0.490281
O  -0.677825 1.539698 -0.317147
N  0.290868 -0.531853 0.318521
C  -3.200581 0.538019 0.394032
C  -4.341323 -0.474664 0.212236
C  -3.32807 1.401448 1.656438
C  -4.258013 -1.265128 -1.109626
C  -0.749969 0.362742 0.119081
C  1.678135 -0.327998 0.082117
C  2.553554 -1.411243 0.365355
C  2.205733 0.893978 -0.413664
C  3.94085 -1.27564 0.156797
C  3.597821 1.012043 -0.616055
C  4.474046 -0.061523 -0.335716
H  -3.096227 1.182604 -0.499904
H  -4.337436 -1.169182 1.074747
H  -5.295311 0.087186 0.258884
H  -3.385265 0.767394 2.559266
H  -2.466559 2.083644 1.750112
H  -4.246056 2.015325 1.60346
H  -3.30865 -1.825251 -1.168703
H  -4.308465 -0.588317 -1.983144
H  -5.089875 -1.987612 -1.193054
H  0.005496 -1.443665 0.682294
H  2.147597 -2.356622 0.748027
H  1.530175 1.723578 -0.631517
H  4.604054 -2.118899 0.379462
H  3.998798 1.957624 -0.998335
H  5.551882 0.044224 -0.497642
