program: Gaussian 09
title: 000259741
version: EM64L-G09RevD.01
frameworkgroup: C1[X(C13H11NO3)]
method: RPBEPBE
basis: SDD
operation: Freq
keyword: #p
keyword: freq=noraman
keyword: PBEPBE/SDD
title: #p freq=noraman PBEPBE/SDD
converged: YES YES NO NO
title: Mulliken charges:
elementType: O O O N C C C C C C C C C C C C C H H H H H H H H H H H
charge: -0.348616 -0.219631 -0.226108 -0.166227 0.147271 0.424243 0.295911 -0.448900 -0.364752 -0.416746 -0.352021 -0.223741 -0.232695 -0.236897 0.308352 -0.602364 -0.057739 0.241962 0.251261 0.240860 0.272939 0.232792 0.232418 0.231391 0.268221 0.255155 0.253996 0.239665
chargesum: 0.00000
title: Mulliken charges with hydrogens summed into heavy atoms:
elementType: O O O N C C C C C C C C C C C C C
charge: -0.348616 -0.219631 -0.226108 -0.166227 0.147271 0.424243 0.295911 -0.206938 -0.113490 -0.175886 -0.079082 0.009051 -0.000277 -0.005506 0.308352 0.175008 0.181926
polarizability: 2.15556035e+02 2.33136704e+00 1.93297725e+02 2.54709762e+00 4.43641751e+00 7.66538128e+01
1716.lowfreq: -8.7897 -4.5515 -0.0006 0.0002 0.0005 2.1121 14.6973 39.6622 67.6497
frequency: 14.3960 39.6437 67.6427 89.9964 98.9718 141.0501 173.6680 176.1501 205.1629 232.6047 275.0565 327.1688 336.2880 352.6339 414.0006 426.2383 468.0028 490.1419 507.7708 528.0689 562.0287 603.5682 631.2703 689.8010 702.8601 738.3733 749.3679 780.8383 784.7083 800.2109 812.6561 863.6508 877.9309 905.2598 964.4110 974.3475 980.3764 981.5168 996.2517 1021.1548 1043.0596 1076.8520 1095.2273 1131.4459 1146.0951 1172.9649 1178.6873 1221.2587 1237.6916 1262.3862 1271.4686 1284.7884 1377.1980 1377.9835 1404.3948 1421.0340 1427.7108 1442.8685 1454.0869 1476.7656 1479.3474 1514.8155 1580.9355 1599.3980 1612.3222 1639.4820 1665.5216 3015.1844 3057.7081 3111.4968 3126.3526 3133.6526 3136.5446 3139.8479 3157.0807 3159.2735 3172.7829 3194.2045
redmass: 6.2793 5.5010 4.7039 5.7398 1.0379 4.8640 4.5128 4.2612 6.3153 6.0649 4.6053 3.5399 2.8996 6.1489 3.4958 4.2951 3.2555 8.7685 7.1525 7.6942 3.5115 6.9721 3.3834 10.8825 5.8567 2.1095 2.4791 1.9786 4.3237 3.7511 1.9013 4.8522 1.6101 1.4923 1.3558 4.1485 1.3932 1.5885 1.3415 2.7101 2.5545 2.1747 3.1596 1.3053 1.5051 1.0831 1.2987 2.0028 1.9901 1.7226 3.1207 5.0170 1.4433 1.7366 3.8456 4.1723 1.1885 2.8129 2.5069 1.0444 1.0670 3.8827 7.6360 5.5395 7.5186 7.1662 10.2942 1.0327 1.0907 1.1029 1.0864 1.0876 1.1025 1.0896 1.0953 1.0957 1.0987 1.0953
irintensity: 0.0432 0.1465 0.2539 1.4882 0.1921 0.2063 11.3237 1.5605 7.3971 3.3361 0.5482 10.8109 15.8169 27.4583 5.1422 2.2342 0.0939 0.3892 1.6271 1.1960 9.9079 7.7519 0.2810 18.5797 5.0203 2.6386 4.5887 66.2837 11.1816 74.0798 53.2546 16.2901 2.9148 3.1362 0.6958 18.0609 5.2850 1.2447 0.2116 43.5077 56.7584 36.2905 560.9447 0.0159 27.2338 1.0499 76.5138 171.5676 37.6567 87.4563 348.9015 97.7970 27.2913 14.5762 14.7362 5.6095 80.7957 1.4097 12.7555 19.9964 15.3132 16.5368 12.7190 13.6805 499.1893 2.9587 109.8728 24.4845 18.0245 15.3461 1.0641 1.8721 0.5597 10.4853 24.5130 29.9271 18.4146 0.9557
temp: 298.150 k
press: 1.00000 atm
elementType: 8 8 8 7 6 6 6 6 6 6 6 6 6 6 6 6 6 1 1 1 1 1 1 1 1 1 1 1
symmnumber: 1
zpe: 554978.5 jmol-1
zpe.correction: 0.211380 hartree
zpe.thermalcorrener: 0.226196 hartree
zpe.thermalcorrenthalpy: 0.227140 hartree
zpe.thermalcorrgfe: 0.167511 hartree
zpe.sumelectzpe: -781.226784 hartree
zpe.sumelectthermal: -781.211968 hartree
zpe.sumelectthermalent: -781.211024 hartree
zpe.sumelectthermalfe: -781.270653 hartree
dipole: 2.4166 -0.8770 0.1075
dipole: 2.5731
quadrupole: -90.8018 -96.5200 -103.1964
quadrupole: 8.3200 -3.7560 7.3450
quadrupole: 6.0376 0.3194 -6.3570 8.3200 -3.7560 7.3450
hfenergy: -781.4381641 hartree
pointgroup: C01 [X(C13H11N1O3)]
dipole: -0.9625264 -0.3076268 -0.0609425 debye
polarizability: 215.0402377|-1.3170051|187.2347741|-7.8418019|26.5908906|83.232561 unknown
InChI: InChI=1S/C13H11NO3/c1-14(9-15)13(16)17-12-8-4-6-10-5-2-3-7-11(10)12/h2-9H,1H3
charge 0 multiplicity 1
28 atoms
O  0.987135 -0.113556 0.057084
O  1.995838 -1.487688 -1.585874
O  4.375851 1.70049 0.900126
N  3.242234 0.097155 -0.386583
C  -1.393473 0.282102 0.106241
C  -2.751561 -0.225105 0.10571
C  -0.330165 -0.671062 -0.040361
C  -2.979898 -1.632709 -0.045837
C  -1.169049 1.690224 0.251109
C  -3.833454 0.70468 0.255387
C  -0.560441 -2.03782 -0.182756
C  -1.908044 -2.51447 -0.188913
C  -2.247044 2.567154 0.392382
C  -3.589796 2.072029 0.396531
C  2.057645 -0.593478 -0.719119
C  4.459679 -0.259615 -1.15309
C  3.316616 1.088757 0.623975
H  -4.010161 -2.006045 -0.047863
H  -0.142643 2.067616 0.245961
H  -4.860312 0.320486 0.256267
H  0.26987 -2.735704 -0.303996
H  -2.08644 -3.588148 -0.306592
H  -2.06694 3.642131 0.50058
H  -4.424585 2.772033 0.509846
H  5.280408 0.364158 -0.768785
H  4.304333 -0.065515 -2.226543
H  4.695689 -1.327318 -1.017572
H  2.354212 1.255419 1.137883
