program: Gaussian 09
title: 000259734
version: EM64L-G09RevD.01
frameworkgroup: C1[X(C8H11NO4)]
method: RPBEPBE
basis: SDD
operation: Freq
keyword: #p
keyword: freq=noraman
keyword: PBEPBE/SDD
title: #p freq=noraman PBEPBE/SDD
converged: YES YES NO NO
title: Mulliken charges:
elementType: O O O O N C C C C C C C C H H H H H H H H H H H
charge: -0.269326 -0.241716 -0.284726 -0.273563 -0.123395 -0.384728 -0.399316 0.215801 -0.396631 0.201202 0.241513 -0.497591 -0.505349 0.260024 0.248962 0.248430 0.245860 0.284775 0.237931 0.246056 0.243134 0.238046 0.229443 0.235167
chargesum: 0.00000
title: Mulliken charges with hydrogens summed into heavy atoms:
elementType: O O O O N C C C C C C C C
charge: -0.269326 -0.241716 -0.284726 -0.273563 -0.123395 0.124258 0.094973 0.215801 -0.111856 0.201202 0.241513 0.229529 0.197306
polarizability: 1.59251579e+02 -1.69088116e+01 1.30703399e+02 1.25482666e+00 -3.75378031e+00 6.26285961e+01
1716.lowfreq: -9.6250 -0.0009 -0.0004 -0.0002 3.1017 4.8317 37.4997 56.4206 76.0382
frequency: 37.4579 56.3972 76.0341 92.7114 95.9184 105.3311 119.7855 142.0821 151.6718 182.9461 222.3125 229.7518 283.2908 292.4771 356.7211 397.0391 405.4257 507.4928 652.6782 689.1171 696.9107 727.0984 738.3854 776.8847 824.7575 856.5765 888.1766 942.3372 951.7930 988.2924 1006.8906 1061.2432 1099.6999 1110.0210 1110.6327 1113.7730 1123.2649 1129.6380 1139.2723 1147.9543 1150.9536 1216.6194 1276.2473 1418.3497 1423.0224 1449.8714 1452.0954 1460.8187 1462.4428 1463.8200 1466.2593 1490.5398 1594.1912 1607.4591 1623.7784 2996.2805 3006.1945 3085.1239 3093.0186 3096.1437 3108.4885 3140.6965 3153.8659 3188.5646 3209.4967 3209.8227
redmass: 5.4595 4.8501 2.2961 1.9823 1.2874 1.7271 2.3700 3.4505 3.6458 4.0531 4.6115 4.5743 6.2332 4.2436 5.9142 5.7422 6.2605 9.3603 5.9783 4.5818 4.4851 5.5943 6.7878 1.0350 6.8131 1.5263 7.7524 5.4842 4.5050 1.9943 1.8948 2.3846 1.2897 1.3373 1.2666 1.2615 1.7664 1.6720 2.1360 1.4943 1.6775 5.9633 1.9042 1.1968 1.1867 1.0506 1.0499 1.0871 1.0558 1.1082 1.3675 2.2352 10.3224 10.0204 9.4026 1.0299 1.0296 1.0507 1.1038 1.0597 1.1046 1.1039 1.1048 1.1183 1.1083 1.0983
irintensity: 1.2239 5.2247 3.1990 1.0286 0.5946 0.4102 2.4455 3.3606 2.2570 10.9955 0.3006 19.9505 8.9595 22.5209 16.1363 0.5440 2.1281 14.0792 3.5296 12.6831 0.3843 14.2644 25.2728 22.9277 3.8581 34.8137 13.6620 0.6214 12.1650 53.5440 55.9575 114.6938 3.8608 0.5199 0.1640 0.2177 171.1572 38.4711 211.7364 1.0758 91.0239 333.8415 91.2079 5.9935 39.6090 12.6349 15.6081 8.2959 12.3144 16.2242 6.1627 20.4229 186.3679 537.8172 43.2626 48.6954 32.3420 19.8995 31.6269 24.3952 24.5975 22.4829 12.5056 4.2124 8.9046 12.3205
temp: 298.150 k
press: 1.00000 atm
elementType: 8 8 8 8 7 6 6 6 6 6 6 6 6 1 1 1 1 1 1 1 1 1 1 1
symmnumber: 1
zpe: 480745.7 jmol-1
zpe.correction: 0.183106 hartree
zpe.thermalcorrener: 0.197634 hartree
zpe.thermalcorrenthalpy: 0.198579 hartree
zpe.thermalcorrgfe: 0.140320 hartree
zpe.sumelectzpe: -666.030932 hartree
zpe.sumelectthermal: -666.016404 hartree
zpe.sumelectthermalent: -666.015459 hartree
zpe.sumelectthermalfe: -666.073718 hartree
dipole: -0.8894 -0.7245 1.4201
dipole: 1.8256
quadrupole: -67.5322 -66.9859 -75.4060
quadrupole: 3.3371 -0.4269 2.1634
quadrupole: 2.4425 2.9888 -5.4313 3.3371 -0.4269 2.1634
hfenergy: -666.2140379 hartree
pointgroup: C01 [X(C8H11N1O4)]
dipole: 0.3503529 0.4496391 0.4369754 debye
dipolederiv: -0.7728319 -0.3049571 0.1023308 -0.6894652 -1.1481229 0.2582117 0.1867533 0.236739 -0.35165 -0.8583006 0.2889589 -0.0680025 -0.0237871 -0.7079143 0.1214136 0.0343891 0.1193599 -0.3408898 -1.3092623 0.5377156 -0.1693121 0.7398112 -0.9298118 0.1638692 -0.157871 0.1217882 -0.3436915 -0.842954 -0.0933115 -0.0311832 -0.2197275 -0.6923607 0.0402687 -0.0089643 0.0732072 -0.3291174 -0.0869225 -0.2260979 0.0823992 0.721963 -1.5377746 0.5105651 0.1678812 0.062449 -0.4497225 0.0387498 0.1150633 -0.0145883 -0.0352982 0.3798886 -0.0587273 -0.0148449 -0.0140195 0.2894485 0.1294278 -0.0405066 0.0066927 -0.1724151 0.4458872 -0.0514395 0.0204789 0.0099615 0.2649305 -0.1961655 -0.1886707 0.046998 -0.7202672 1.2609327 -0.3224035 -0.0160223 -0.0763003 0.1250377 -1.0300806 0.5778408 -0.1901504 0.0353014 -0.4071795 0.0765104 -0.0345891 0.0213976 -0.2781079 1.4616177 -0.1372814 0.0173402 0.5426651 1.4154755 -0.3315794 -0.1698246 -0.3134776 0.32418 2.0438584 -0.6420721 0.2668632 -0.3170911 1.1629793 -0.1587831 0.1229356 -0.178995 0.2852182 0.544003 0.2613355 -0.0750974 0.23112 0.4041117 -0.0334419 -0.0627908 -0.0328469 0.2867014 0.7390823 -0.20626 0.0708662 -0.0717906 0.2558187 -0.0004579 0.0285614 -0.001803 0.2847809 0.0335576 -0.1257808 0.0183831 -0.0602252 0.0334123 -0.0392264 -0.0173417 -0.060754 0.064572 0.0366134 -0.0084864 0.06778 0.035929 0.0018717 -0.0924236 0.0148495 0.0247709 -0.0356828 0.040757 0.0030493 -0.0860284 -0.0036038 0.0024392 -0.0749104 -0.1369869 0.0332151 -0.0318548 0.0102047 0.1339649 -0.0282432 0.0735129 -0.0198755 -0.040612 0.0207017 -0.0713177 0.0623628 0.109826 0.0118808 -0.0152893 -0.0458733 0.0534932 0.0325162 0.0248104 0.0426744 0.1703046 0.0712208 0.0327651 -0.0073811 -0.0342805 -0.096998 0.059595 0.0087514 0.0581768 0.1072341 -0.0333281 -0.0533328 0.0791159 0.0402612 0.0260104 -0.0977076 0.0781077 -0.0498277 -0.0147564 -0.0335784 -0.0858522 -0.0382213 -0.00496 0.0787385 0.0446817 -0.0893063 -0.0073412 -0.0737512 -0.0498519 0.0391851 -0.0336571 -0.0829571 0.0312442 -0.1247326 -0.0615521 -0.081837 -0.041451 0.0124807 0.0727047 -0.0186917 0.1328984 -0.0962914 0.0424177 -0.0269152 0.0384743 0.1115282 -0.0581236 0.0381455 0.0170766 -0.0717201 0.0840254 0.076396 0.088789 0.0463059 -0.0856237 unknown
polarizability: 158.0009631|-16.687536|126.0328499|6.6603566|-19.7054554|68.5497611 unknown
InChI: InChI=1S/C8H11NO4/c1-12-7(10)5-6(8(11)13-2)9-3-4-9/h5H,3-4H2,1-2H3
charge 0 multiplicity 1
24 atoms
O  2.11061 1.391592 -0.427718
O  3.033288 -0.661299 0.154914
O  -2.62816 1.311165 -0.377277
O  -2.421194 -0.984371 0.027248
N  0.47319 -1.773414 0.29406
C  -0.34945 -2.560303 1.230358
C  1.184546 -2.682513 1.216108
C  0.591732 -0.420832 0.061091
C  -0.449219 0.474113 -0.150392
C  2.023285 0.052397 -0.057691
C  -1.869082 0.14025 -0.14014
C  3.487725 1.924927 -0.559523
C  -4.090349 1.108587 -0.428117
H  -0.970941 -3.33704 0.777946
H  -0.818659 -2.020411 2.059942
H  1.754068 -2.234276 2.037909
H  1.6550 -3.554356 0.751219
H  -0.190529 1.506374 -0.386128
H  3.351055 2.977796 -0.841486
H  4.036812 1.369989 -1.338431
H  4.026037 1.833477 0.398791
H  -4.356457 0.413373 -1.243108
H  -4.507127 2.109391 -0.611109
H  -4.459083 0.693987 0.526135
