program: Gaussian 09
title: 000023539
version: EM64L-G09RevD.01
frameworkgroup: C1[X(C8H8N2S)]
method: RPBEPBE
basis: SDD
operation: Freq
keyword: #pfreq=noraman
keyword: PBEPBE/SDD
title: #p freq=noraman PBEPBE/SDD
converged: NO NO NO YES
title: Mulliken charges:
elementType: S N N C C C C C C C C H H H H H H H H
charge: 0.229578 -0.409066 -0.033315 0.285274 0.021954 -0.203055 -0.356167 -0.339380 -0.214935 -0.228912 -0.807952 0.314494 0.232550 0.245009 0.223751 0.224430 0.288411 0.288410 0.238921
chargesum: 0.00000
title: Mulliken charges with hydrogens summed into heavy atoms:
elementType: S N N C C C C C C C C
charge: 0.229578 -0.094572 -0.033315 0.285274 0.021954 -0.203055 -0.123616 -0.094370 0.008816 -0.004482 0.007789
polarizability: 1.89232197e+02 -7.81045719e-01 1.13625622e+02 5.44956142e-03 1.66162800e-03 4.89444764e+01
1716.lowfreq: -0.1525 -0.0001 0.0018 0.0023 5.7508 15.7747 48.8605 97.8573 123.9752
frequency: 48.8512 97.8486 123.9673 138.2557 247.1558 268.5659 300.5527 379.8297 426.9147 485.0459 558.1271 579.0664 581.4732 612.1879 651.5741 661.3861 751.6464 767.3313 793.2402 856.2446 874.7998 928.9786 932.9680 974.6228 989.4208 1003.9775 1007.9091 1106.5617 1151.7890 1162.7235 1206.8611 1257.8844 1276.9560 1336.3627 1347.8496 1412.0651 1418.0361 1433.6543 1453.9734 1461.1551 1477.5884 1593.7217 1630.9464 3027.0502 3129.8335 3142.0904 3154.2356 3157.7807 3160.2694 3171.0214 3597.6119
redmass: 3.5655 1.6216 2.0328 3.6192 4.4669 4.7306 6.0917 9.4928 2.9820 5.1632 1.2220 3.8561 7.8862 6.7260 5.8628 7.5182 1.3419 3.5732 5.1625 1.4838 6.5124 8.3437 1.3824 1.3020 1.1726 1.3114 1.9681 1.7169 1.7662 1.2282 2.8513 3.2366 2.0155 2.8310 1.1776 2.8205 3.5121 1.0517 1.2462 2.8037 2.7008 6.8140 7.4634 1.0279 1.0853 1.0905 1.1048 1.0958 1.1061 1.0993 1.0813
irintensity: 8.0716 0.4154 0.0401 3.3555 6.9524 2.7122 1.1693 8.1423 11.2072 1.8302 95.6651 0.0059 3.0118 0.8578 9.2886 6.4963 111.5241 7.5031 1.2283 0.1675 2.3775 4.4304 4.5478 0.0516 8.8757 5.0349 11.0566 2.9902 13.3600 13.5907 11.5101 56.4056 8.7308 60.4383 20.6444 3.0313 228.0992 14.3678 17.7160 31.7712 33.9351 1.1886 4.4092 21.2680 0.2230 12.8994 7.2507 26.1073 8.3352 18.8499 48.7488
temp: 298.150 k
press: 1.00000 atm
elementType: 16 7 7 6 6 6 6 6 6 6 6 1 1 1 1 1 1 1 1
symmnumber: 1
zpe: 378677.7 jmol-1
zpe.correction: 0.144231 hartree
zpe.thermalcorrener: 0.153957 hartree
zpe.thermalcorrenthalpy: 0.154901 hartree
zpe.thermalcorrgfe: 0.108351 hartree
zpe.sumelectzpe: -816.438449 hartree
zpe.sumelectthermal: -816.428722 hartree
zpe.sumelectthermalent: -816.427778 hartree
zpe.sumelectthermalfe: -816.474329 hartree
dipole: 0.3897 -1.7097 -0.0002
dipole: 1.7535
quadrupole: -61.8702 -62.8310 -76.5574
quadrupole: 3.4432 0.0005 0.0003
quadrupole: 5.2160 4.2552 -9.4712 3.4432 0.0005 0.0003
hfenergy: -816.5826793 hartree
pointgroup: C01 [X(C8H8N2S1)]
dipole: 0.1339804 0.6767457 0.0000829 debye
dipolederiv: -0.7310333 0.0911327 0.0000139 -0.0456013 -0.0721875 0.0000026 -0.000008 -0.0000057 -0.0716907 -0.851038 0.0754865 0.0000147 -0.0902259 -0.4709024 0.0000047 -0.0000092 -0.0000064 -0.2573808 -0.9554456 -0.2135599 0.0000108 -0.3943486 -0.562224 -0.0000134 -0.0000071 -0.0000038 -0.2241433 0.2517336 0.1921101 -0.0000079 0.6003519 0.0342142 -0.0000298 0.000008 -0.0000195 0.0586523 0.5580914 0.1247379 -0.0000226 -0.2862913 -0.0618895 0.0000111 -0.0000361 -0.0000082 0.0169434 1.4093508 -0.0809389 -0.0000125 0.269236 0.6479964 0.00003 0.0000466 0.0000439 -0.0039362 0.1088235 -0.0779228 -0.0000173 -0.0355191 0.0532671 0.000012 -0.0000167 0.0000208 -0.1908811 0.049972 -0.0211203 -0.0000148 0.0237568 0.1115029 0.0000097 -0.0000101 0.0000103 -0.1560209 -0.0869826 -0.0207135 -0.0000152 -0.1926732 0.0326831 0.0000159 -0.0000172 0.0000101 -0.1801439 -0.1115742 0.0686947 -0.0000073 0.2053073 0.0027363 -0.0000058 0.0000034 -0.0000007 -0.18532 0.1168599 -0.1316402 -0.0000005 -0.1847189 0.1569794 0.0000005 -0.0000113 -0.000001 0.0500407 0.1732347 -0.0042209 0.0000112 0.0023655 0.1971764 -0.0000087 0.000008 -0.0000093 0.3594857 0.0700698 0.013544 0.0000072 0.0525441 -0.103279 -0.0000134 0.0000093 -0.0000151 0.1813114 0.0907389 0.0477015 0.0000068 0.0093219 -0.0691122 -0.0000095 0.0000048 -0.0000093 0.1655193 -0.1219987 0.0688096 0.0000223 0.0652814 0.0644742 -0.0000079 0.0000251 -0.0000087 0.1656172 -0.0653881 -0.1093783 0.0000119 -0.1123094 -0.0005764 0.0000021 0.0000112 0.0000021 0.1656028 0.1133827 -0.0174404 -0.0584493 0.0585013 -0.0201168 -0.0724733 -0.0413991 -0.0506215 -0.0118561 0.113376 -0.0174426 0.0584489 0.0585031 -0.0201201 0.0724736 0.0414027 0.0506219 -0.0118552 -0.1321726 0.0121608 -0.0000002 -0.0034816 0.0793778 -0.0000003 -0.0000042 0. 0.1300553 unknown
polarizability: 189.1253718|2.9453931|113.732448|-0.0054949|0.0015048|48.9444764 unknown
InChI: InChI=1S/C8H8N2S/c1-11-8-9-6-4-2-3-5-7(6)10-8/h2-5,9H,1H3
charge 0 multiplicity 1
19 atoms
S  3.322302 0.770416 -0.000316
N  0.604795 1.42106 -0.000252
N  1.011775 -0.831659 -0.000345
C  -0.663724 0.8086 -0.000197
C  -0.387909 -0.603435 -0.00026
C  1.55826 0.391933 -0.000335
C  -1.973407 1.325359 -0.000101
C  -1.455434 -1.52793 -0.000229
C  -3.027228 0.382896 -0.000059
C  -2.772059 -1.018656 -0.000117
C  3.977211 -0.992895 -0.000322
H  0.799926 2.4206 -0.000223
H  -2.178056 2.401197 -0.000045
H  -1.255179 -2.603768 -0.000281
H  -4.063596 0.738223 0.000029
H  -3.618933 -1.713797 -0.000078
H  3.619938 -1.513221 -0.899385
H  3.619921 -1.513234 0.898727
H  5.074197 -0.89949 -0.000311
