program: Gaussian 09
title: 000259809
version: EM64L-G09RevD.01
frameworkgroup: C1[X(C17H19N5O6)]
method: RPBEPBE
basis: SDD
operation: Freq
keyword: #p
keyword: freq=noraman
keyword: PBEPBE/SDD
title: #p freq=noraman PBEPBE/SDD
converged: YES YES NO NO
title: Mulliken charges:
elementType: O O O O O O N N N N N C C C C C C C C C C C C C C C C C H H H H H H H H H H H H H H H H H H H
charge: -0.300368 -0.416787 -0.472328 -0.430206 -0.334498 -0.215035 -0.241977 -0.040858 -0.437575 -0.053023 -0.621219 -0.210538 -0.221241 -0.161873 -0.088246 -0.350809 0.369821 0.201731 -0.128585 0.013333 0.138976 -0.423364 0.454250 -0.371138 -0.403422 -0.228308 -0.223111 -0.226481 0.308977 0.319215 0.267234 0.256038 0.230995 0.244071 0.359262 0.400366 0.344133 0.336531 0.261136 0.242910 0.309568 0.354384 0.244706 0.238635 0.235576 0.233665 0.235478
chargesum: 0.00000
title: Mulliken charges with hydrogens summed into heavy atoms:
elementType: O O O O O O N N N N N C C C C C C C C C C C C C C C C C
charge: -0.300368 -0.057525 -0.071962 -0.093675 -0.334498 -0.215035 -0.241977 -0.040858 -0.093442 -0.053023 0.042733 0.098439 0.097974 0.105361 0.167793 0.124257 0.369821 0.201731 -0.128585 0.013333 0.138976 0.080681 0.454250 -0.126432 -0.164787 0.007267 0.010554 0.008997
polarizability: 3.21088272e+02 -1.37518703e+01 2.26117684e+02 4.89363063e+00 -4.75441684e+00 1.71464019e+02
1716.lowfreq: -0.0004 0.0003 0.0004 3.2485 6.1508 6.8563 16.0940 21.9566 24.8849
frequency: 16.0627 21.7074 24.7617 31.1271 37.0830 48.3599 71.3791 94.2662 99.7220 112.9218 120.2215 134.5998 149.8619 176.8485 201.1682 205.0208 211.9900 236.2388 270.4039 276.7273 285.9032 293.6776 312.1684 325.0205 333.2166 340.2727 353.0388 359.9198 373.1363 402.1724 420.4638 440.0438 447.3051 469.4291 486.1223 507.3870 533.7164 543.9492 550.5540 567.6350 575.3305 617.0144 629.7657 635.3778 650.7862 679.7242 691.5971 702.0254 719.1020 724.1030 750.0351 763.9884 770.4593 776.0569 815.1280 828.5748 853.2882 856.8743 863.6275 872.3081 905.4120 932.8746 940.4296 947.6600 952.7793 966.0818 981.6187 982.8288 991.1084 997.7641 1003.0583 1011.5075 1027.1476 1043.1759 1062.5953 1087.1164 1091.5802 1095.5021 1154.5606 1171.5710 1175.8862 1184.3809 1189.1905 1191.3936 1212.7337 1230.9278 1233.6597 1253.0198 1260.6603 1267.3235 1280.9661 1291.1647 1310.8906 1319.4849 1327.6738 1331.7452 1337.6981 1343.8413 1367.8299 1374.3303 1377.4537 1386.5803 1396.4043 1404.6771 1441.8221 1446.9091 1473.6276 1487.8875 1496.1522 1518.7880 1549.8706 1595.0720 1600.5082 1617.2876 1629.7455 1644.2268 3019.4014 3024.6028 3032.9308 3038.0899 3043.8742 3102.1921 3105.6845 3124.2825 3125.4327 3126.1825 3139.1647 3153.3460 3168.8184 3377.8914 3500.3795 3534.0205 3545.9270 3567.6551 3697.3993
redmass: 4.5335 5.4388 5.4619 6.1043 6.0953 6.2858 5.2955 3.7509 4.7749 6.0542 6.2563 7.5520 4.6806 8.4739 5.5824 5.3803 5.9651 4.4983 4.4046 2.9813 1.3849 4.0486 3.2317 2.7969 3.2115 1.9946 3.6738 4.5755 1.4443 2.7999 4.5052 4.2744 3.1564 3.3557 3.5755 3.7355 1.1610 3.9257 4.4901 1.4760 2.1127 6.3439 9.4540 6.6273 10.6318 6.6309 8.2138 2.2270 4.7708 2.9608 4.3052 7.4130 2.9539 4.4743 4.9473 7.8469 3.7390 1.3359 2.8294 7.8578 4.3778 1.4832 4.2296 2.2287 1.6693 2.6118 2.7554 1.4389 6.2385 5.2781 1.3260 3.9879 2.1896 3.1630 3.0484 1.9521 1.5617 6.4711 3.3979 1.3480 1.0553 1.5300 1.0982 1.1190 1.6674 2.2502 2.5594 1.4375 1.7418 1.9831 1.7314 1.4528 1.4713 3.3156 1.2752 1.2406 1.1785 1.3208 1.7987 1.5138 1.4177 8.5324 3.3416 1.2333 2.1898 1.0838 1.1145 2.5016 5.8805 6.9293 4.0783 6.0657 1.6008 6.1150 11.4703 3.4878 1.0741 1.0763 1.0582 1.0847 1.0877 1.1090 1.1025 1.0886 1.0868 1.0887 1.0914 1.0960 1.1016 1.0684 1.0786 1.0657 1.0454 1.0660 1.1047
irintensity: 0.5378 0.4911 2.1317 0.8835 2.1124 7.5563 0.4455 1.4984 12.5329 1.1879 2.0495 2.0110 9.0397 2.7588 3.7022 3.5549 1.4552 8.3882 24.8176 30.0260 77.8592 28.6808 1.1104 9.8306 8.2255 54.8201 10.1449 24.4725 83.0851 0.7280 5.3792 10.6188 2.6170 22.0020 20.4110 17.2865 284.7671 31.3293 36.7046 65.5315 75.0884 0.1870 13.5927 28.1201 0.3409 21.0675 9.5958 35.5850 48.1757 53.1092 56.5875 12.5747 23.6611 37.1220 21.9553 18.5084 4.2223 0.8644 6.8346 301.3439 68.8221 1.7147 58.6929 71.5315 4.3660 10.9682 59.0156 2.0778 0.5741 89.1717 0.5130 70.6604 3.5173 43.1253 34.0060 32.0529 8.4967 27.3193 55.8912 13.5779 0.0088 8.6434 0.9686 1.4148 85.1536 29.7703 7.1773 5.4606 59.8528 135.5824 28.3187 6.0043 16.7966 62.0331 7.1967 25.1949 4.0934 112.6385 42.5390 51.0328 17.5231 7.5827 178.1812 32.1188 10.8518 8.0052 16.9301 1.7646 108.4108 338.2875 359.4634 0.9951 37.2745 1.3864 514.8797 365.2189 10.6264 8.7218 14.3203 20.5828 51.2053 6.2346 19.0564 0.4786 6.2529 2.7004 10.9192 28.9581 19.9168 294.3466 73.0013 11.0488 103.6020 3.6778 44.2111
temp: 298.150 k
press: 1.00000 atm
elementType: 8 8 8 8 8 8 7 7 7 7 7 6 6 6 6 6 6 6 6 6 6 6 6 6 6 6 6 6 1 1 1 1 1 1 1 1 1 1 1 1 1 1 1 1 1 1 1
symmnumber: 1
zpe: 938986.2 jmol-1
zpe.correction: 0.357641 hartree
zpe.thermalcorrener: 0.383563 hartree
zpe.thermalcorrenthalpy: 0.384507 hartree
zpe.thermalcorrgfe: 0.299210 hartree
zpe.sumelectzpe: -1382.211457 hartree
zpe.sumelectthermal: -1382.185535 hartree
zpe.sumelectthermalent: -1382.184590 hartree
zpe.sumelectthermalfe: -1382.269888 hartree
dipole: -2.4437 7.3793 -4.7202
dipole: 9.0943
quadrupole: -128.3957 -197.6665 -167.5865
quadrupole: 29.0252 -17.3430 3.2244
quadrupole: 36.1539 -33.1169 -3.0369 29.0252 -17.3430 3.2244
hfenergy: -1382.5690978 hartree
pointgroup: C01 [X(C17H19N5O6)]
dipole: 0.5130158 3.1666398 1.584615 debye
polarizability: 310.7162964|31.5438921|235.9133715|-12.2571732|-2.2375655|172.040307 unknown
InChI: InChI=1S/C17H19N5O6/c18-16-20-13-10(14(26)21-16)19-17(27-7-8-4-2-1-3-5-8)22(13)15-12(25)11(24)9(6-23)28-15/h1-5,9,11-12,15,20,23-25H,6-7,18H2
charge 0 multiplicity 1
47 atoms
O  -2.114352 2.070766 0.622263
O  0.087792 3.267585 2.214151
O  0.660463 1.948696 -1.26532
O  -3.395931 2.755512 -2.003722
O  1.408456 -0.290973 0.207695
O  -2.258192 -4.4389 -0.310268
N  -0.943436 -0.045849 0.721167
N  -0.192886 -2.106295 0.027046
N  -3.366231 -0.611658 0.94071
N  -3.897123 -2.925506 0.449222
N  -5.584417 -1.430444 1.097544
C  -1.054711 1.305692 1.307326
C  0.184047 2.221457 1.196631
C  0.066573 2.806399 -0.243399
C  -1.466937 2.926626 -0.469561
C  -1.964286 2.474029 -1.845723
C  -2.043181 -0.910805 0.655379
C  0.149051 -0.855086 0.311218
C  -1.593071 -2.165279 0.242139
C  -2.548093 -3.278836 0.085279
C  -4.256132 -1.7075 0.817969
C  2.495613 -1.281579 -0.192245
C  3.74397 -0.482873 -0.451138
C  3.908047 0.205866 -1.681428
C  4.766387 -0.404625 0.527605
C  5.074076 0.962111 -1.926881
C  5.936825 0.347373 0.281664
C  6.091225 1.033119 -0.945586
H  -1.380828 1.214366 2.359272
H  1.142487 1.719719 1.38602
H  0.55511 3.797272 -0.272833
H  -1.839022 3.948366 -0.271532
H  -1.725397 1.407462 -2.008356
H  -1.462091 3.063307 -2.629277
H  -0.788826 3.726498 2.128277
H  1.205234 1.225749 -0.841122
H  -3.670473 0.364704 0.997861
H  -3.90034 2.171692 -1.382839
H  2.119014 -1.820445 -1.078321
H  2.595823 -1.99507 0.642556
H  -5.881709 -0.600703 1.604903
H  -6.231513 -2.207738 0.98473
H  3.127101 0.142644 -2.449306
H  4.646401 -0.935901 1.479538
H  5.192453 1.489627 -2.87932
H  6.724453 0.39748 1.041164
H  6.999082 1.615544 -1.137851
