program: Gaussian 09
title: 000259715
version: EM64L-G09RevD.01
frameworkgroup: C1[X(C13H18O8S)]
method: RPBEPBE
basis: SDD
operation: Freq
keyword: #p
keyword: freq=noraman
keyword: PBEPBE/SDD
title: #p freq=noraman PBEPBE/SDD
converged: YES YES NO NO
title: Mulliken charges:
elementType: S O O O O O O O O C C C C C C C C C C C C C H H H H H H H H H H H H H H H H H H
charge: 0.207724 -0.186214 -0.279891 -0.270787 -0.269682 -0.246544 -0.233207 -0.244343 -0.181010 -0.169162 0.042222 -0.058516 -0.463268 -0.364613 0.335905 0.320255 0.313568 0.027988 -0.758631 -0.772896 -0.757893 -0.713946 0.324702 0.305727 0.266538 0.299757 0.260959 0.225544 0.247138 0.261214 0.250018 0.273375 0.246043 0.244849 0.246983 0.255757 0.255802 0.254264 0.244660 0.259612
chargesum: 0.00000
title: Mulliken charges with hydrogens summed into heavy atoms:
elementType: S O O O O O O O O C C C C C C C C C C C C C
charge: 0.207724 -0.186214 -0.279891 -0.270787 -0.269682 -0.246544 -0.233207 -0.244343 -0.181010 0.155540 0.347949 0.208021 -0.163511 0.121890 0.335905 0.320255 0.313568 0.027988 -0.000262 -0.008629 0.000649 0.044590
polarizability: 2.10703185e+02 3.92777537e+00 1.70497219e+02 -8.25821720e+00 -1.34323537e+00 1.72594579e+02
1716.lowfreq: -0.0022 -0.0021 -0.0007 2.7375 6.7939 9.7934 16.0438 28.5211 34.1078
frequency: 15.4870 28.4604 34.0598 41.3053 48.1286 53.1860 59.4734 63.2580 67.3874 69.7429 71.2925 79.8307 93.1165 104.9095 115.1263 127.1955 166.1229 188.5236 197.8898 210.3794 232.3324 250.6905 262.5457 279.5839 324.5940 356.8841 377.0654 392.4970 412.6912 451.1708 472.2272 489.4904 503.6570 509.0170 549.4950 559.6266 562.1731 577.8692 596.6722 611.7263 626.1574 641.1712 710.8995 779.1812 817.9011 825.1483 871.9695 873.0246 884.4978 925.5521 948.2306 962.7676 975.9858 991.6182 993.4924 998.0415 1009.6710 1011.7222 1020.3222 1042.6516 1043.4993 1045.5237 1054.1565 1098.3203 1111.1661 1157.1490 1180.4088 1190.6645 1201.6093 1211.4396 1244.4725 1264.9768 1289.7512 1295.3130 1312.5340 1329.2560 1343.0716 1354.8220 1364.9831 1377.1942 1382.7640 1385.2355 1385.8224 1445.6771 1450.9896 1452.3173 1452.5084 1453.1910 1453.9988 1454.1565 1455.0022 1456.8772 1646.8780 1654.0695 1663.5627 1666.1825 2985.6295 2992.9437 2995.0182 3004.2344 3007.3441 3007.6882 3045.1308 3050.5097 3067.7479 3089.0374 3099.1237 3099.2650 3099.4297 3115.5113 3120.0096 3141.7260 3143.9042 3143.9696
redmass: 6.7713 5.7931 6.3019 6.4551 5.8836 1.7550 1.8567 1.6332 1.4647 1.8242 1.8881 3.0124 5.0806 5.1156 1.0807 5.3082 7.5519 7.3512 7.5323 8.3168 4.8328 5.2363 3.9235 8.2389 3.9140 3.6140 3.6783 4.9905 3.7032 7.8958 4.0628 5.3451 3.6516 4.0656 3.3438 3.2740 3.2476 4.1836 5.1226 5.5159 5.0886 4.5901 5.7621 5.1679 5.8038 4.5351 5.1070 3.9986 5.1374 4.7368 3.6297 2.6673 3.1070 2.6816 1.9984 1.9877 3.5802 1.6084 4.3066 1.6627 1.6619 1.6564 2.3188 2.1715 2.3628 2.4566 2.9760 3.3415 2.0656 1.5647 1.3126 1.2187 1.4053 1.3030 1.3261 1.4739 1.4394 1.3553 1.3547 1.1949 1.2516 1.2393 1.2473 1.0548 1.0768 1.0563 1.0547 1.0547 1.0539 1.0555 1.0614 1.0544 9.9702 9.7294 9.8840 10.0266 1.0673 1.0846 1.0365 1.0381 1.0380 1.0380 1.0848 1.0843 1.0867 1.0959 1.0952 1.0944 1.0950 1.0975 1.1021 1.1022 1.1018 1.1020
irintensity: 0.0853 0.3509 0.2990 0.4093 0.4340 1.8971 3.6399 3.3092 0.1542 2.9276 1.8820 7.1605 1.3854 4.3995 0.4677 1.2605 3.0857 8.9189 2.0523 5.8358 2.0475 3.1623 8.5110 3.1939 2.2231 1.2998 12.0447 10.3902 4.9509 8.9589 10.1388 23.1339 2.2539 10.2287 4.1995 1.9008 2.6762 99.6020 4.9587 17.1831 19.4369 13.2188 11.9390 19.5067 20.9341 12.1979 25.1115 61.1301 53.4581 54.5156 48.7121 79.5564 6.7359 44.9723 32.2054 90.2288 241.1847 15.3201 72.7358 12.1848 10.4083 14.1520 51.3527 26.7205 165.5728 37.5162 163.2170 659.0388 111.8144 86.3601 7.6974 17.7135 4.0970 3.4274 13.2743 3.2070 0.4238 6.5075 9.6991 44.3195 61.5812 109.8592 3.0718 23.9423 35.6983 6.7247 22.6627 14.7667 42.2315 1.0654 20.6875 14.0814 174.1632 235.1236 195.4775 103.1667 28.1087 3.7592 1.4837 1.3609 0.8042 0.8616 12.5263 7.6831 4.1070 6.2690 7.3546 4.7662 5.8575 9.1396 7.3720 8.7985 10.3762 7.0217
temp: 298.150 k
press: 1.00000 atm
elementType: 16 8 8 8 8 8 8 8 8 6 6 6 6 6 6 6 6 6 6 6 6 6 1 1 1 1 1 1 1 1 1 1 1 1 1 1 1 1 1 1
symmnumber: 1
zpe: 789862.3 jmol-1
zpe.correction: 0.300843 hartree
zpe.thermalcorrener: 0.326275 hartree
zpe.thermalcorrenthalpy: 0.327219 hartree
zpe.thermalcorrgfe: 0.240833 hartree
zpe.sumelectzpe: -1504.345471 hartree
zpe.sumelectthermal: -1504.320038 hartree
zpe.sumelectthermalent: -1504.319094 hartree
zpe.sumelectthermalfe: -1504.405480 hartree
dipole: 2.4313 0.0519 -0.6330
dipole: 2.5129
quadrupole: -123.7581 -133.7980 -137.3228
quadrupole: 0.1274 -1.3312 -10.8991
quadrupole: 7.8682 -2.1717 -5.6965 0.1274 -1.3312 -10.8991
hfenergy: -1504.6463135 hartree
pointgroup: C01 [X(C13H18O8S1)]
dipole: -0.772905 0.4812437 0.3852561 debye
polarizability: 193.5115462|-17.9574638|183.5176717|-11.2427852|8.8190345|176.7657647 unknown
InChI: InChI=1S/C13H18O8S/c1-6(14)19-10-5-18-13(22-9(4)17)12(21-8(3)16)11(10)20-7(2)15/h10-13H,5H2,1-4H3
charge 0 multiplicity 1
40 atoms
S  -2.840918 -0.081726 -1.074624
O  -1.089056 -1.922082 -0.17597
O  0.949379 0.242598 1.713285
O  -0.334288 1.728861 -0.345219
O  1.754741 -1.973415 -1.105756
O  2.126913 2.244617 1.422212
O  1.012607 2.176443 -2.200757
O  2.71659 -3.950666 -0.329834
O  -3.726802 0.276116 1.516071
C  1.160972 -0.119851 0.28424
C  -0.086595 0.286273 -0.536803
C  1.346036 -1.646926 0.288516
C  -1.326161 -0.477104 -0.043919
C  0.039408 -2.362803 0.66869
C  1.455848 1.484803 2.150128
C  0.330482 2.595955 -1.243721
C  2.441341 -3.189172 -1.282632
C  -4.049739 0.275255 0.31066
C  1.049811 1.72614 3.584338
C  0.108386 4.030493 -0.839179
C  2.750724 -3.407514 -2.743909
C  -5.44872 0.53099 -0.211952
H  2.054959 0.39876 -0.102176
H  0.12524 0.069665 -1.600125
H  2.151701 -1.94557 0.984045
H  -1.580904 -0.205861 1.001106
H  0.117725 -3.44762 0.506336
H  -0.176935 -2.1586 1.737457
H  1.657905 2.536174 4.012246
H  -0.015251 2.019819 3.615693
H  1.156981 0.8073 4.182903
H  0.816082 4.271871 -0.024452
H  -0.914265 4.18034 -0.458546
H  0.306863 4.696068 -1.692075
H  3.515711 -4.19047 -2.848626
H  3.088768 -2.47121 -3.216113
H  1.833198 -3.730563 -3.26862
H  -5.930409 1.319092 0.390812
H  -5.449911 0.814903 -1.276529
H  -6.045519 -0.393382 -0.0974
