program: Gaussian 09
title: 000259742
version: EM64L-G09RevD.01
frameworkgroup: C1[X(C18H10Cl4N2O2)]
method: RPBEPBE
basis: SDD
operation: Freq
keyword: #p
keyword: freq=noraman
keyword: PBEPBE/SDD
title: #p freq=noraman PBEPBE/SDD
converged: YES YES NO NO
title: Mulliken charges:
elementType: Cl Cl Cl Cl O O N N C C C C C C C C C C C C C C C C C C H H H H H H H H H H
charge: 0.035590 0.035601 -0.040308 -0.040306 -0.230582 -0.230589 -0.468986 -0.468965 0.486852 0.486731 -0.546177 -0.546171 0.130528 0.130611 0.451274 0.451294 -0.413308 -0.413310 -0.323900 -0.323902 -0.179910 -0.179912 -0.194883 -0.194915 -0.121588 -0.121588 0.358431 0.358432 0.253997 0.253995 0.279417 0.279447 0.261595 0.261595 0.261955 0.261956
chargesum: 0.00000
title: Mulliken charges with hydrogens summed into heavy atoms:
elementType: Cl Cl Cl Cl O O N N C C C C C C C C C C C C C C C C C C
charge: 0.035590 0.035601 -0.040308 -0.040306 -0.230582 -0.230589 -0.110555 -0.110533 0.486852 0.486731 -0.546177 -0.546171 0.130528 0.130611 0.451274 0.451294 -0.159311 -0.159315 -0.044483 -0.044455 0.081686 0.081683 0.067071 0.067042 -0.121588 -0.121588
polarizability: 6.44450654e+02 4.03000764e+01 2.35028370e+02 9.76077686e-03 1.10036194e-02 1.52917802e+02
1716.lowfreq: -10.5399 -4.7368 -0.0010 0.0013 0.0017 0.5772 12.8243 25.8789 37.4296
frequency: 12.8237 25.8152 37.4245 39.1761 40.7321 65.8941 76.8461 103.7202 121.8649 131.8053 145.2155 155.0828 178.4448 187.2071 213.3709 225.7494 242.9837 261.1638 298.3377 300.3509 308.7408 316.6898 357.3317 372.3803 381.7898 400.5735 413.3386 413.4796 419.4412 454.5263 482.1010 493.7263 509.8453 559.4245 585.2978 599.7241 619.1932 629.4197 632.2354 655.4751 702.0807 704.4762 729.6967 740.9305 752.8396 766.0244 784.1437 800.8653 813.9065 815.3923 819.0351 824.7688 861.3406 873.0867 887.2367 945.6820 947.0710 957.5216 957.6866 995.1963 995.6139 1000.4682 1073.9020 1074.4171 1113.6483 1115.1711 1163.3418 1176.6082 1185.1185 1187.4770 1232.6594 1252.1301 1290.9283 1295.0601 1305.4531 1320.7887 1372.4421 1372.5276 1406.0050 1406.0661 1471.3364 1477.2747 1487.3560 1495.2977 1553.1455 1563.1755 1590.0180 1594.5592 1598.2494 1598.8870 1609.9502 1621.0451 3144.8389 3144.8524 3164.5159 3164.5353 3175.7903 3175.8015 3183.8090 3183.8323 3283.2476 3288.7625
redmass: 14.9406 8.8691 11.9174 5.5329 10.2189 6.0485 13.9519 9.2250 10.7002 9.4689 9.7935 9.7903 18.1318 12.9845 8.9202 8.8102 11.5300 9.5034 13.9566 11.5476 6.7811 7.5390 6.4900 5.6677 9.6470 10.0739 3.0008 2.9909 10.1068 11.3637 5.2008 3.1627 3.8483 8.2517 6.9395 8.9900 7.2061 7.6313 7.3882 6.6021 3.8267 3.9133 7.3059 7.7000 8.6400 4.2159 1.4379 1.5607 1.3276 1.2780 1.5477 1.7158 6.3505 3.3448 3.7123 1.3561 1.3692 1.3559 1.3555 3.9727 3.9726 8.6000 2.7912 2.8064 1.3346 1.3246 4.8045 2.5282 1.1478 1.4417 3.2328 4.7235 1.5855 1.3339 2.2672 3.7107 5.8123 5.8200 3.7750 3.7781 2.3878 2.2518 2.7950 3.5549 3.5427 5.2832 4.5186 4.1674 5.5539 5.7596 11.0311 11.3661 1.0902 1.0902 1.0889 1.0889 1.0962 1.0962 1.0978 1.0978 1.0736 1.0741
irintensity: 0.0254 0.1536 0.0572 0.1060 0.3644 0.1427 2.0641 3.4026 0.0572 1.3973 0.0327 0.9497 0.4909 0.0534 0.3674 2.2980 0.0484 0.0710 0.0192 1.7808 1.1062 0.0004 1.1465 1.3562 33.9187 0.9729 0.2050 0.7419 101.9328 5.7257 21.3603 28.3300 37.8374 0.0645 5.9162 17.5929 7.4768 9.6192 1.0589 0.8183 2.3767 11.8049 13.2436 101.2682 6.1526 11.9449 86.3513 25.0181 12.1866 4.2374 45.9425 37.3940 2.4315 71.2991 84.0874 2.7152 2.8494 1.3204 0.0029 117.1292 7.4148 33.5796 163.6156 10.4545 9.0492 15.8779 85.0653 0.0003 2.6867 0.0994 3.1525 65.5548 80.7381 0.1087 98.7126 1.2640 15.2764 0.1300 2.2356 30.0671 21.2157 53.9286 1437.8052 5.0485 16.8945 230.0455 0.9963 86.9223 24.9491 1.1259 540.9646 21.4340 3.6122 3.4161 4.5881 1.8641 6.7079 1.4064 0.2033 0.5095 1.4471 208.5100
temp: 298.150 k
press: 1.00000 atm
elementType: 17 17 17 17 8 8 7 7 6 6 6 6 6 6 6 6 6 6 6 6 6 6 6 6 6 6 1 1 1 1 1 1 1 1 1 1
symmnumber: 1
zpe: 622404.0 jmol-1
zpe.correction: 0.237061 hartree
zpe.thermalcorrener: 0.260179 hartree
zpe.thermalcorrenthalpy: 0.261123 hartree
zpe.thermalcorrgfe: 0.181021 hartree
zpe.sumelectzpe: -2790.298196 hartree
zpe.sumelectthermal: -2790.275079 hartree
zpe.sumelectthermalent: -2790.274134 hartree
zpe.sumelectthermalfe: -2790.354237 hartree
dipole: 0.0004 -0.0001 0.5274
dipole: 0.5274
quadrupole: -180.3329 -186.8312 -174.6348
quadrupole: 16.5680 0.0021 -0.0034
quadrupole: 0.2667 -6.2315 5.9648 16.5680 0.0021 -0.0034
hfenergy: -2790.5352572 hartree
pointgroup: C01 [X(C18H10Cl4N2O2)]
dipole: 0.0001257 -0.2074783 -0.0001786 debye
polarizability: 646.2260047|-0.032414|152.9178315|-29.9010977|-0.0456858|233.2529902 unknown
InChI: InChI=1S/C18H10Cl4N2O2/c19-9-1-5-11(6-2-9)23-15-13(21)18(26)16(14(22)17(15)25)24-12-7-3-10(20)4-8-12/h1-8,23-24H
charge 0 multiplicity 1
36 atoms
Cl -2.039391 0.97611 2.528392
Cl 2.03974 0.97863 -2.526782
Cl -7.935652 -1.516766 1.641967
Cl 7.93515 -1.516147 -1.644448
O  0.967981 0.766836 2.557124
O  -0.967728 0.770734 -2.555764
N  -2.722018 0.497657 -0.665993
N  2.722214 0.496189 0.666918
C  -1.436638 0.583701 -0.201332
C  1.436833 0.583076 0.202425
C  -0.958009 0.687533 1.102272
C  0.958237 0.688619 -1.101045
C  0.457373 0.683166 1.387038
C  -0.45714 0.68488 -1.385828
C  -3.922738 0.042313 -0.055542
C  3.922785 0.041423 0.055735
C  -5.152815 0.552574 -0.548507
C  5.15303 0.550706 0.549286
C  -3.92836 -0.966043 0.944039
C  3.928062 -0.965492 -0.945298
C  -6.377307 0.080292 -0.036567
C  6.377357 0.078858 0.036548
C  -5.150702 -1.436973 1.463271
C  5.150238 -1.435969 -1.465333
C  -6.359092 -0.906065 0.970273
C  6.358805 -0.906058 -0.971695
H  -2.743488 0.660436 -1.692203
H  2.743788 0.657622 1.693338
H  -5.15108 1.330701 -1.319567
H  5.151559 1.327736 1.32145
H  -2.990256 -1.398945 1.29974
H  2.989813 -1.397625 -1.30156
H  -7.325743 0.47743 -0.408354
H  7.325926 0.475245 0.408796
H  -5.159857 -2.213851 2.232621
H  5.159128 -2.211729 -2.235814
