program: Gaussian 09
title: 000259693
version: EM64L-G09RevD.01
frameworkgroup: C1[X(C18H24O3)]
method: RPBEPBE
basis: SDD
operation: Freq
keyword: #pfreq=noraman
keyword: PBEPBE/SDD
title: #p freq=noraman PBEPBE/SDD
converged: YES YES NO NO
title: Mulliken charges:
elementType: O O O C C C C C C C C C C C C C C C C C C H H H H H H H H H H H H H H H H H H H H H H H H
charge: -0.449914 -0.445332 -0.436169 0.406342 -0.135943 -0.164194 -0.185959 -0.196788 -0.521277 -0.566339 -0.488677 -0.456349 -0.171612 -0.823536 0.240560 -0.624276 0.276489 -0.344395 -0.540916 -0.443441 0.289047 0.241345 0.248344 0.217889 0.203664 0.193935 0.226273 0.225323 0.226108 0.225640 0.191023 0.225717 0.199936 0.244005 0.222615 0.259396 0.214014 0.229636 0.251688 0.336892 0.224243 0.342499 0.258819 0.219837 0.353835
chargesum: 0.00000
title: Mulliken charges with hydrogens summed into heavy atoms:
elementType: O O O C C C C C C C C C C C C C C C C C C
charge: -0.113022 -0.102832 -0.082334 0.406342 0.105402 0.084150 0.031930 0.006876 -0.101070 -0.114907 -0.072013 -0.030696 0.072394 -0.127511 0.240560 -0.142952 0.276489 -0.120152 -0.282098 -0.223604 0.289047
polarizability: 2.62102127e+02 -8.92424044e+00 1.88151504e+02 5.61569869e+00 1.17881136e+01 1.36405715e+02
1716.lowfreq: -3.0352 -0.0009 -0.0006 -0.0002 3.7923 13.8484 36.2407 59.6080 90.3303
frequency: 36.1802 59.5282 90.3080 98.2720 114.7966 134.2273 184.6736 198.7541 202.0727 219.7377 228.9859 242.9534 256.1526 279.9881 285.8419 307.4575 322.2113 326.5208 348.4186 357.1904 362.9400 407.5320 416.5590 441.5246 456.9992 465.4513 489.3304 505.0841 527.5748 542.4833 559.9035 571.6584 610.7194 634.1427 699.4554 707.1858 721.2581 760.4590 780.3780 807.3024 817.9955 838.1025 842.3354 855.8522 880.0821 893.4236 915.6476 923.7152 930.4782 950.7504 958.6019 983.6797 991.6654 1011.2368 1020.0803 1027.9138 1040.3465 1046.7433 1074.2347 1085.5750 1100.5475 1111.7335 1132.2705 1141.4027 1149.6712 1161.0179 1174.0081 1177.2791 1178.6677 1187.2714 1199.9555 1216.0765 1220.5115 1231.0445 1243.3918 1250.9292 1257.7946 1266.4663 1278.4201 1282.2575 1288.9046 1296.7184 1311.6287 1321.8372 1323.1237 1335.5629 1337.4919 1338.3546 1351.7705 1373.2571 1374.1665 1381.3136 1385.7621 1398.1710 1440.9858 1447.5988 1458.5120 1466.3318 1471.8667 1482.6031 1491.8226 1493.1229 1494.2119 1584.4532 1631.0738 2901.7823 2923.6500 2938.0788 2959.1579 2965.6584 2971.5162 2985.6007 2989.8199 2997.2877 3005.4534 3030.6281 3033.6552 3042.4843 3046.7603 3049.1271 3071.2230 3085.8415 3096.3105 3113.7804 3144.1051 3150.2081 3544.7066 3572.8008 3582.3019
redmass: 4.3981 4.3587 4.7193 4.6612 3.8452 2.3932 3.5765 3.5081 1.8666 3.5362 2.6698 1.8387 1.2166 3.4661 3.2050 3.5552 1.4772 1.6275 1.1193 3.3316 2.1541 3.3987 3.4297 2.9795 3.3172 3.4919 3.8904 3.3464 3.7404 4.8738 3.9116 2.8841 3.3278 3.1694 5.4034 3.2097 2.4417 4.1870 2.1373 2.0328 2.3064 1.9243 1.8864 2.0904 1.7007 2.1754 2.3888 2.4903 1.4455 2.0341 2.2734 2.8266 2.1627 1.9124 2.3729 2.0607 2.8163 2.2540 2.7195 1.8986 2.0495 2.0393 1.4914 2.0679 1.4061 1.3584 1.6070 1.2069 1.7445 1.2250 1.7527 1.2384 1.8292 1.5816 1.3992 1.5417 2.5805 1.6038 1.5438 1.4226 1.6528 1.3565 1.4671 1.4781 1.3975 1.5196 1.4153 1.4364 1.5212 1.3100 1.5761 2.0718 1.8210 1.2789 2.3061 1.3168 1.0800 1.0787 1.0839 1.0837 1.0860 2.5818 1.0708 7.1365 6.4681 1.0796 1.0837 1.0807 1.0642 1.0788 1.0678 1.0603 1.0607 1.0379 1.0618 1.0961 1.0967 1.1023 1.0888 1.0997 1.1033 1.0979 1.0991 1.0888 1.0917 1.0939 1.0659 1.0662 1.0660
irintensity: 0.2341 0.5971 1.9793 1.2111 1.8855 1.0684 6.8591 2.8880 2.0361 3.4133 6.9999 3.7059 121.0794 2.7260 4.7753 7.1014 73.0629 47.4744 143.3107 5.4394 0.1715 5.9718 2.2410 4.6822 2.4336 1.4861 14.1710 3.8232 1.2546 2.5305 3.1292 9.8936 3.1501 0.7844 0.2990 3.7093 2.7631 5.2539 11.3512 47.7835 6.3203 10.5479 2.1886 17.1491 5.0840 19.7011 2.7881 23.8692 1.2325 25.6836 5.2393 24.9427 73.9681 11.1264 33.7482 24.1528 17.0045 23.9369 6.2187 27.1989 12.0182 32.7677 5.3937 11.4933 103.2618 19.8480 71.8119 25.8966 2.9892 11.2210 16.9846 0.8364 4.2993 3.8288 12.9487 1.5767 21.9408 21.0327 20.3357 0.7649 1.1247 11.5686 5.2951 3.4957 1.1155 12.0982 0.0528 0.6031 8.4292 30.9238 6.7864 5.7950 6.6028 22.8046 9.3336 7.6721 6.1607 5.6795 10.5392 2.8329 2.2029 103.9077 9.3866 30.0594 50.5000 11.9727 23.0705 22.5600 38.7352 16.2515 36.1654 27.0503 31.8426 29.1789 48.2196 37.1850 17.7135 49.7917 37.4540 12.3637 66.4152 31.5610 18.8431 19.6859 11.7373 12.1258 4.1547 3.2883 40.6845
temp: 298.150 k
press: 1.00000 atm
elementType: 8 8 8 6 6 6 6 6 6 6 6 6 6 6 6 6 6 6 6 6 6 1 1 1 1 1 1 1 1 1 1 1 1 1 1 1 1 1 1 1 1 1 1 1 1
symmnumber: 1
zpe: 1006621.5 jmol-1
zpe.correction: 0.383402 hartree
zpe.thermalcorrener: 0.402562 hartree
zpe.thermalcorrenthalpy: 0.403506 hartree
zpe.thermalcorrgfe: 0.337872 hartree
zpe.sumelectzpe: -924.388808 hartree
zpe.sumelectthermal: -924.369648 hartree
zpe.sumelectthermalent: -924.368704 hartree
zpe.sumelectthermalfe: -924.434338 hartree
dipole: 0.0048 -1.3950 -0.5304
dipole: 1.4924
quadrupole: -114.4889 -127.2810 -127.5086
quadrupole: -15.0085 1.2423 7.9294
quadrupole: 8.6039 -4.1882 -4.4158 -15.0085 1.2423 7.9294
hfenergy: -924.77221 hartree
pointgroup: C01 [X(C18H24O3)]
dipole: 0.0036387 -0.545809 -0.2164284 debye
polarizability: 262.2725913|-8.4802746|187.7057396|4.572386|12.6017429|136.6810156 unknown
InChI: InChI=1S/C18H24O3/c1-18-7-6-13-12-3-2-11(19)8-10(12)9-15(20)17(13)14(18)4-5-16(18)21/h2-3,8,13-17,19-21H,4-7,9H2,1H3
charge 0 multiplicity 1
45 atoms
O  -5.097839 -1.376867 0.112883
O  0.245061 2.357469 -1.455833
O  5.9476 -0.287432 0.398643
C  -2.697427 -0.71314 0.138134
C  -1.998658 0.638478 -0.212051
C  -0.525347 0.658392 0.225023
C  0.228556 -0.479787 -0.530422
C  -4.125235 -0.388381 -0.375157
C  -1.964334 -1.85285 -0.606555
C  -2.979029 1.726159 0.304436
C  -0.444131 -1.862649 -0.283065
C  -4.393832 1.071296 0.120323
C  0.182826 2.011777 -0.015772
C  -2.754462 -1.008605 1.660357
C  1.738967 -0.451517 -0.244953
C  1.585117 1.983319 0.616909
C  2.377412 0.724778 0.259703
C  2.554932 -1.576268 -0.53063
C  3.777914 0.742366 0.454746
C  3.949997 -1.56555 -0.329925
C  4.562258 -0.392483 0.169453
H  -1.991588 0.72186 -1.322192
H  -0.463337 0.466189 1.317872
H  0.08803 -0.26955 -1.616754
H  -4.112386 -0.406142 -1.488951
H  -2.098109 -1.713079 -1.700354
H  -2.408091 -2.833733 -0.349835
H  -2.876243 2.665591 -0.265862
H  -2.789373 1.96515 1.368431
H  -0.271307 -2.169763 0.766754
H  0.035659 -2.633924 -0.914883
H  -4.937666 1.022678 1.082049
H  -5.022356 1.638066 -0.59083
H  -0.412323 2.836096 0.413612
H  -3.14205 -0.15025 2.237162
H  -3.433301 -1.859772 1.837798
H  -1.761947 -1.264287 2.068188
H  1.474483 2.040065 1.719314
H  2.146743 2.886123 0.311219
H  -5.992945 -1.149355 -0.242402
H  2.09705 -2.490065 -0.922486
H  0.953079 1.806565 -1.878563
H  4.275863 1.641392 0.83381
H  4.548862 -2.456217 -0.5609
H  6.406104 -1.132639 0.166356
