program: Gaussian 09
title: 000259717
version: EM64L-G09RevD.01
frameworkgroup: C1[X(C16H22O10S)]
method: RPBEPBE
basis: SDD
operation: Freq
keyword: #p
keyword: freq=noraman
keyword: PBEPBE/SDD
title: #p freq=noraman PBEPBE/SDD
converged: YES YES NO NO
title: Mulliken charges:
elementType: S O O O O O O O O O O C C C C C C C C C C C C C C C C H H H H H H H H H H H H H H H H H H H H H H
charge: 0.136750 -0.184203 -0.269884 -0.288133 -0.265232 -0.249048 -0.245298 -0.233621 -0.234218 -0.177538 -0.245966 -0.172827 -0.036875 -0.041892 -0.055955 -0.493107 -0.333892 0.335292 0.321003 0.312336 0.040713 -0.758314 -0.773224 0.298800 -0.759701 -0.715472 -0.756503 0.347407 0.285773 0.298425 0.263165 0.352626 0.252589 0.250577 0.248590 0.252644 0.256718 0.246894 0.244029 0.278601 0.261149 0.254296 0.248803 0.256174 0.243813 0.258157 0.245479 0.252291 0.247809
chargesum: 0.00000
title: Mulliken charges with hydrogens summed into heavy atoms:
elementType: S O O O O O O O O O O C C C C C C C C C C C C C C C C
charge: 0.136750 -0.184203 -0.269884 -0.288133 -0.265232 -0.249048 -0.245298 -0.233621 -0.234218 -0.177538 -0.245966 0.174580 0.248898 0.256533 0.207210 -0.140481 0.169274 0.335292 0.321003 0.312336 0.040713 -0.000361 -0.003701 0.298800 0.004547 0.042672 -0.010924
polarizability: 2.42565295e+02 2.64045494e+01 2.28417064e+02 1.33034810e+01 2.88001799e+00 2.11449211e+02
1716.lowfreq: -6.9787 -5.0002 0.0016 0.0017 0.0017 4.4379 17.1807 24.2783 25.2086
frequency: 17.1322 24.2449 25.1683 29.2973 35.5806 37.8559 38.1273 48.2595 50.6546 56.5112 59.7338 62.5782 64.4460 70.7556 71.6816 83.3192 88.6700 97.3254 125.7613 128.3042 138.7428 152.7107 167.5134 177.0968 195.5361 210.6345 224.4693 231.5033 266.5289 279.0809 285.7014 306.1838 339.3845 365.1123 391.0270 404.5129 435.1647 460.0876 465.0669 491.3565 497.2675 504.2242 524.2575 551.5890 560.1867 564.9144 567.0408 574.9157 600.2507 608.7617 620.8538 639.1916 660.2508 685.5143 771.7656 779.1702 828.0488 837.4163 859.6338 865.4219 896.8549 922.6388 946.1396 958.4522 961.3384 976.7612 990.8168 994.0194 996.0903 1007.8055 1011.0971 1013.7941 1023.6561 1042.7403 1043.6108 1044.7927 1045.2890 1046.3602 1108.7978 1118.9085 1137.2800 1159.5349 1176.8560 1180.3034 1195.1871 1207.0695 1210.1811 1222.2786 1236.8588 1269.8220 1289.3024 1303.7867 1315.8563 1329.6125 1348.7236 1360.1210 1363.7436 1375.5447 1382.4043 1383.3762 1385.6385 1387.4616 1391.9225 1443.4832 1451.9908 1452.4390 1452.6837 1453.5718 1453.7325 1454.0993 1454.4086 1455.1351 1457.5965 1458.1981 1646.5979 1648.9163 1659.2555 1664.7521 1665.7302 2994.3057 3004.0914 3006.5287 3006.9153 3007.5038 3015.7758 3024.0309 3040.9571 3048.5248 3063.3197 3067.3890 3088.2757 3093.7062 3099.4806 3100.0094 3100.1813 3100.3572 3121.6305 3140.1260 3141.1209 3143.6259 3144.3022
redmass: 5.6588 5.6308 8.5538 3.9296 1.2194 4.7619 4.3795 1.2436 4.6960 2.3722 5.4548 4.3960 2.4104 1.0928 1.3560 3.8282 6.2567 4.3559 3.8767 1.1996 8.1130 6.7797 5.7228 7.8501 7.7174 5.4803 3.5590 4.7243 4.9076 6.4835 4.8326 4.9093 4.9362 3.7090 4.7691 3.6483 6.4266 4.2177 5.6739 4.2858 4.4721 3.6148 4.9454 3.3055 3.2511 3.4548 3.1338 4.2423 5.0377 5.3349 5.2793 5.1569 4.7786 6.6257 5.0556 3.7259 5.8930 4.9784 5.6134 5.5200 4.3940 3.8866 5.5900 4.1668 2.8431 3.9711 2.2106 2.1119 1.9287 2.2861 1.7179 2.6074 2.7912 2.4889 1.7699 1.6999 1.6945 1.7284 2.2822 2.8334 2.1809 2.4991 2.9807 3.0206 3.1822 3.1578 1.5027 1.1897 1.2967 1.3445 1.1950 1.2399 1.4209 1.3344 1.4343 1.3578 1.3528 1.2030 1.2687 1.2477 1.2432 1.2389 1.6487 1.0552 1.0551 1.0571 1.0546 1.0570 1.0569 1.0530 1.0536 1.0556 1.0536 1.0791 9.9112 9.9184 9.9010 10.1904 9.9523 1.0365 1.0382 1.0383 1.0385 1.0381 1.0818 1.0598 1.0831 1.0864 1.0853 1.0870 1.0955 1.1066 1.0942 1.0947 1.0942 1.0939 1.1022 1.1026 1.1023 1.1023 1.1022
irintensity: 0.7596 0.1523 0.1402 0.9194 0.6491 0.9511 1.3526 0.2420 1.3825 3.5449 0.2368 5.1511 1.0355 0.2060 1.0469 3.9483 1.6592 5.5264 0.7800 0.8898 2.1841 3.4649 3.1275 3.0273 8.1279 3.3423 6.5249 3.5078 2.0204 2.6937 2.9931 19.8527 6.8919 6.8287 24.1577 7.7613 5.2094 6.3972 6.9807 3.2772 41.0094 2.1349 2.0335 6.8012 3.2143 3.1273 1.3220 137.6323 7.4027 20.7413 6.0625 13.3965 7.1890 87.4322 11.8999 26.8008 9.8198 61.8658 81.8141 14.5170 35.6943 120.3623 66.7594 62.1753 68.5993 37.3393 24.2971 113.9223 61.9292 72.2268 40.7660 120.2795 74.3181 24.5905 14.6479 13.9210 28.1489 31.7299 230.0347 36.1888 20.9819 12.2443 267.8865 236.1323 669.6666 118.7238 71.9132 15.4789 9.8285 22.0309 10.2763 2.5123 2.5962 0.0275 0.6919 4.6132 4.7024 43.4099 49.3339 52.8297 87.0762 33.4536 12.6301 24.2903 26.6771 2.7951 26.8432 7.3533 6.4129 15.8267 37.4846 29.8807 16.4452 19.4471 226.1031 196.5142 130.8832 253.7215 121.2332 1.1918 1.3716 2.1081 0.5325 1.0294 3.0019 13.2682 5.3851 19.0795 8.0101 1.8687 7.0985 9.2351 5.7316 6.0664 5.6084 8.5522 9.4177 9.5228 7.9247 7.3123 8.1229
temp: 298.150 k
press: 1.00000 atm
elementType: 16 8 8 8 8 8 8 8 8 8 8 6 6 6 6 6 6 6 6 6 6 6 6 6 6 6 6 1 1 1 1 1 1 1 1 1 1 1 1 1 1 1 1 1 1 1 1 1 1
symmnumber: 1
zpe: 968323.7 jmol-1
zpe.correction: 0.368815 hartree
zpe.thermalcorrener: 0.400652 hartree
zpe.thermalcorrenthalpy: 0.401596 hartree
zpe.thermalcorrgfe: 0.298724 hartree
zpe.sumelectzpe: -1771.139932 hartree
zpe.sumelectthermal: -1771.108094 hartree
zpe.sumelectthermalent: -1771.107150 hartree
zpe.sumelectthermalfe: -1771.210023 hartree
dipole: 2.1381 0.6983 3.9817
dipole: 4.5731
quadrupole: -168.5107 -167.3469 -151.5199
quadrupole: 8.5185 15.3695 -4.9531
quadrupole: -6.0515 -4.8878 10.9393 8.5185 15.3695 -4.9531
hfenergy: -1771.5087466 hartree
pointgroup: C01 [X(C16H22O10S1)]
dipole: 0.7102968 -0.9925392 -1.321901 debye
polarizability: 235.3542288|-30.5236165|234.8347299|-2.015399|-3.9118761|212.2426112 unknown
InChI: InChI=1S/C16H22O10S/c1-7(17)22-6-12-13(23-8(2)18)14(24-9(3)19)15(25-10(4)20)16(26-12)27-11(5)21/h12-16H,6H2,1-5H3
charge 0 multiplicity 1
49 atoms
S  0.884292 -2.708966 -0.237103
O  1.201097 -0.193046 0.981326
O  -1.264012 -0.785317 -1.480713
O  -0.737157 2.039581 -1.30373
O  -1.524034 -0.416173 2.204545
O  3.275383 1.30703 -0.564935
O  -3.045484 0.367213 -2.467692
O  -2.429005 3.078712 -0.073984
O  -3.650074 -1.361768 1.9871
O  2.035583 -3.517954 2.141554
O  4.17681 3.415908 -0.157803
C  -1.458984 -0.049684 -0.204283
C  -0.493517 1.150227 -0.145833
C  -1.131991 -1.060656 0.914787
C  0.971171 0.673529 -0.204801
C  0.367603 -1.366421 1.048197
C  1.96023 1.821852 -0.102071
C  -2.131778 -0.478919 -2.549586
C  -1.812782 2.951512 -1.151679
C  -2.85569 -0.642741 2.627437
C  1.961953 -3.729239 0.914131
C  -1.76651 -1.306693 -3.758604
C  -2.082542 3.666999 -2.448567
C  4.329881 2.228665 -0.523264
C  -3.131525 0.118336 3.900392
C  2.723329 -4.809152 0.173211
C  5.627581 1.575484 -0.943141
H  -2.508521 0.284604 -0.136753
H  -0.685444 1.69872 0.795793
H  -1.72457 -1.980785 0.772554
H  1.149092 0.086046 -1.12657
H  0.595157 -1.832629 2.022939
H  1.654925 2.663995 -0.746516
H  2.051668 2.175318 0.940179
H  -2.604447 -1.312467 -4.470721
H  -0.882014 -0.863847 -4.251865
H  -1.502353 -2.334096 -3.462058
H  -2.605626 4.61484 -2.253517
H  -1.151392 3.844583 -3.009033
H  -2.735905 3.019781 -3.062834
H  -3.350851 1.173203 3.652558
H  -2.252729 0.10627 4.564037
H  -4.006809 -0.312649 4.408123
H  2.896537 -5.668899 0.841022
H  2.194626 -5.133731 -0.737843
H  3.707991 -4.405113 -0.129173
H  6.293298 2.328733 -1.391378
H  6.130173 1.160529 -0.050179
H  5.44627 0.748972 -1.646959
