program: Gaussian 09
title: 000259720
version: EM64L-G09RevD.01
frameworkgroup: C1[X(C21H26O9S)]
method: RPBEPBE
basis: SDD
operation: Freq
keyword: #p
keyword: freq=noraman
keyword: PBEPBE/SDD
title: #p freq=noraman PBEPBE/SDD
converged: YES YES NO NO
title: Mulliken charges:
elementType: S O O O O O O O O O C C C C C C C C C C C C C C C C C C C C C H H H H H H H H H H H H H H H H H H H H H H H H H H
charge: 0.242262 -0.216289 -0.263451 -0.282938 -0.250473 -0.264075 -0.236798 -0.230431 -0.255843 -0.256323 -0.113980 -0.085951 -0.024008 -0.012438 -0.526412 -0.364823 -0.817732 0.321615 0.303393 0.332219 0.529172 -0.774443 -0.762872 0.317099 -0.757834 -0.354003 -0.443471 -0.761974 -0.231629 -0.216951 -0.251254 0.281179 0.303782 0.311476 0.229458 0.258304 0.241908 0.269239 0.263732 0.266653 0.279849 0.244295 0.245217 0.257306 0.252947 0.250427 0.261741 0.243890 0.254910 0.293616 0.230215 0.269072 0.244004 0.247455 0.255562 0.225471 0.228928
chargesum: 0.00000
title: Mulliken charges with hydrogens summed into heavy atoms:
elementType: S O O O O O O O O O C C C C C C C C C C C C C C C C C C C C C
charge: 0.242262 -0.216289 -0.263451 -0.282938 -0.250473 -0.264075 -0.236798 -0.230431 -0.255843 -0.256323 0.167199 0.217831 0.287467 0.217020 -0.268108 0.146323 -0.287347 0.321615 0.303393 0.332219 0.529172 -0.005081 -0.002192 0.317099 0.002706 -0.060387 -0.213256 -0.001444 0.023933 0.008520 -0.022326
polarizability: 3.54862909e+02 6.63758155e+00 2.53141901e+02 -6.43056358e+00 1.59000507e+01 2.18389445e+02
1716.lowfreq: -52.7877 -5.9989 -1.8541 0.0009 0.0009 0.0018 7.1342 20.1109 20.8228
frequency: -52.7770 20.0796 20.7630 26.1175 32.3597 33.8083 36.9583 43.7517 51.6242 53.9798 56.4457 59.7953 66.9264 69.8675 74.4902 83.9966 87.7911 98.3064 104.6624 115.0511 129.9739 143.7942 155.9127 173.9612 185.9281 191.7304 207.0352 232.3791 241.8455 253.8008 265.5275 279.7077 288.2810 332.2086 339.6203 373.2655 395.8835 400.5087 405.8653 425.2490 457.4122 465.5739 485.2344 503.7268 534.7996 551.7636 556.7103 560.2455 565.2948 575.0199 594.1648 608.9326 613.3980 616.3621 634.5036 647.1153 671.3675 677.0876 707.7116 762.6057 781.9717 790.0453 803.4386 805.9030 836.9304 849.5388 864.3979 871.9270 878.6160 903.9049 918.0451 939.4049 948.0014 969.6693 978.2345 983.2310 989.4247 994.3769 998.6281 999.9615 1005.3947 1011.7513 1024.5194 1025.6980 1037.8050 1043.7829 1044.0864 1045.7001 1048.6374 1075.2487 1080.4341 1082.5284 1113.5785 1152.8271 1158.9673 1172.3610 1175.5646 1183.6485 1185.7644 1193.0619 1198.6885 1210.7437 1217.4267 1224.7592 1238.7937 1253.3428 1267.3669 1284.6102 1286.8343 1309.4684 1324.4568 1329.0018 1338.4395 1345.7269 1364.2629 1375.2701 1382.7250 1382.9596 1384.7230 1385.6359 1386.4012 1433.7410 1449.7812 1451.2929 1451.7917 1453.7501 1454.0051 1454.9396 1455.2397 1456.5864 1457.6151 1458.2031 1482.4742 1591.6507 1611.4514 1655.2514 1656.9317 1658.8618 1663.6199 2951.1957 2957.6956 3003.6963 3004.0375 3008.7021 3009.5521 3015.8461 3022.5992 3030.9688 3052.2508 3064.0308 3095.9675 3097.2379 3098.3118 3098.8340 3099.1210 3104.9878 3113.7142 3127.9405 3139.1007 3140.7422 3141.7840 3142.7077 3144.7834 3151.5625 3163.6165
redmass: 1.0853 5.9557 5.6410 7.5963 5.1080 5.6312 5.4329 1.7588 3.4898 5.4374 4.6911 5.3521 3.6997 2.8371 2.6752 3.6507 1.0848 3.8698 4.9136 1.0533 6.3848 7.2628 5.9574 4.9898 8.2546 6.9954 7.2572 4.6677 5.9875 5.6414 5.0694 3.8232 4.4011 6.1494 3.1492 3.4785 3.4460 4.3291 2.8735 3.9125 4.1244 3.6793 4.2817 4.0039 3.6922 3.1979 5.3375 3.2277 3.3041 3.6277 5.5955 4.7844 6.1928 4.8257 4.8015 5.3638 5.8741 5.1901 1.8623 1.7226 4.3560 4.2577 4.6012 5.0539 5.4346 4.2534 1.2472 3.5630 2.0628 4.9082 4.7657 1.5148 5.3457 4.0759 4.4466 1.3755 5.7299 2.1937 2.0963 1.9898 2.1848 1.3301 3.0201 2.2460 2.4221 1.6573 1.6541 1.6512 1.7426 3.5901 1.6380 4.4979 2.5382 2.0793 1.2095 1.0611 3.2647 2.8460 2.1086 1.4185 1.6848 1.8419 2.5482 1.3336 1.2909 1.2614 1.2767 1.1973 1.3769 1.2847 1.3391 1.2712 1.2562 1.2936 1.4198 1.5474 1.6485 2.6105 1.4094 1.2446 1.2421 1.5955 1.3673 1.0567 1.0558 1.0547 1.0740 1.0551 1.0633 1.0544 1.0518 1.0668 2.2895 6.0374 5.9883 9.6710 9.4565 10.8529 9.9923 1.0837 1.0831 1.0385 1.0382 1.0373 1.0369 1.0834 1.0590 1.0572 1.0853 1.0849 1.1053 1.0968 1.0937 1.0963 1.0942 1.1069 1.0872 1.0875 1.1024 1.0918 1.1023 1.1013 1.1016 1.0955 1.1012
irintensity: 1.7400 0.1620 0.1747 0.9652 0.6354 0.6187 0.5182 2.1846 0.4136 2.7177 0.9365 0.8495 2.2426 1.6319 2.2061 7.3826 0.9686 0.9022 0.6132 0.5125 1.3411 3.0272 7.1039 3.6876 1.9950 7.7657 3.1036 2.4053 1.2924 3.0487 2.4483 8.2881 5.8377 1.0946 11.1804 9.3388 6.3456 2.5646 0.6174 22.0976 5.3533 6.3418 5.0199 14.3294 5.8882 4.9773 7.3151 5.1260 5.7237 11.4390 6.3657 1.8363 1.1459 8.0650 0.6670 16.4669 41.9317 3.7246 46.9153 43.0517 29.2180 19.8863 4.1698 8.4575 29.3488 97.2230 1.8124 16.6479 10.1639 24.4066 113.6372 5.5552 69.7424 43.9517 94.1628 0.4368 0.4019 56.4488 97.3852 117.0991 33.2811 0.5491 67.5955 5.8207 14.7389 5.8173 14.1100 12.0251 47.1326 54.6523 5.1874 13.9367 25.0136 19.3932 1.9434 4.5329 338.4527 215.3211 268.5007 242.5410 130.5708 183.8196 3.8252 14.6011 31.1049 5.8469 8.7172 26.1211 5.7216 9.7924 3.5899 0.8244 1.7453 3.7684 8.1818 4.9034 72.7325 7.0399 48.6719 68.3142 41.1999 6.6879 17.3012 20.6647 18.4949 27.5300 16.1329 8.4824 8.8502 19.7308 8.9640 18.2657 17.5708 0.4741 2.3015 137.3706 227.9682 222.6697 113.8314 20.7006 28.0910 1.7475 1.5597 0.8217 1.9760 11.5066 18.9321 23.5323 8.6796 7.5663 8.4678 4.5552 7.3116 4.5032 5.4140 12.0776 7.7190 6.7103 6.3622 20.5522 8.7946 6.5980 9.4453 13.1859 27.2758
temp: 298.150 k
press: 1.00000 atm
elementType: 16 8 8 8 8 8 8 8 8 8 6 6 6 6 6 6 6 6 6 6 6 6 6 6 6 6 6 6 6 6 6 1 1 1 1 1 1 1 1 1 1 1 1 1 1 1 1 1 1 1 1 1 1 1 1 1 1
symmnumber: 1
zpe: 1154905.4 jmol-1
zpe.correction: 0.439880 hartree
zpe.thermalcorrener: 0.473001 hartree
zpe.thermalcorrenthalpy: 0.473945 hartree
zpe.thermalcorrgfe: 0.369491 hartree
zpe.sumelectzpe: -1888.580775 hartree
zpe.sumelectthermal: -1888.547655 hartree
zpe.sumelectthermalent: -1888.546710 hartree
zpe.sumelectthermalfe: -1888.651164 hartree
dipole: 0.5664 2.2584 -2.0771
dipole: 3.1201
quadrupole: -168.6587 -184.8143 -192.7670
quadrupole: 10.5037 13.1338 -13.4529
quadrupole: 13.4213 -2.7343 -10.6870 10.5037 13.1338 -13.4529
hfenergy: -1889.0206551 hartree
pointgroup: C01 [X(C21H26O9S1)]
dipole: 0.4745782 0.859955 -0.7362991 debye
polarizability: 350.7980966|-21.4214131|254.1240976|-0.7669703|19.6434808|221.4720611 unknown
InChI: InChI=1S/C21H26O9S/c1-12(22)26-10-17-18(27-13(2)23)19(28-14(3)24)20(29-15(4)25)21(30-17)31-11-16-8-6-5-7-9-16/h5-9,17-21H,10-11H2,1-4H3
charge 0 multiplicity 1
57 atoms
S  -1.844645 -2.00064 -0.653638
O  -0.456648 0.292082 -0.152385
O  3.377507 -1.468278 -0.22439
O  3.130979 1.401451 -0.360028
O  0.819926 -2.123594 0.853786
O  -0.61901 3.272641 -0.243353
O  3.67353 -2.407876 -2.34179
O  3.723707 1.746579 1.878161
O  1.953941 -4.122922 0.412106
O  -1.974877 3.341768 1.662831
C  2.169211 -0.787825 -0.731746
C  2.006858 0.51995 0.047449
C  0.943175 -1.715411 -0.565476
C  0.68067 1.214413 -0.364098
C  -0.332549 -0.947074 -0.942786
C  0.390877 2.455006 0.474911
C  -3.127764 -0.967729 -1.641777
C  4.024798 -2.326553 -1.146396
C  3.950462 1.925927 0.663717
C  1.371204 -3.366718 1.218716
C  -4.1730 -0.305599 -0.768752
C  5.119569 -3.099605 -0.460599
C  5.088778 2.723636 0.070631
C  -1.785215 3.627605 0.460726
C  1.147252 -3.608258 2.691605
C  -3.79665 0.599997 0.257641
C  -5.549858 -0.561182 -0.99033
C  -2.746262 4.357098 -0.448507
C  -4.779017 1.24925 1.035042
C  -6.536039 0.086161 -0.208962
C  -6.153172 0.995322 0.803042
H  2.301734 -0.57887 -1.811647
H  2.044011 0.343327 1.137368
H  1.071285 -2.614634 -1.194897
H  0.7468 1.493963 -1.439193
H  -0.283024 -0.690093 -2.023511
H  1.292587 3.080544 0.575086
H  0.004241 2.180303 1.472067
H  -3.582653 -1.661349 -2.367076
H  -2.529129 -0.222761 -2.194346
H  4.655187 -3.967966 0.042705
H  5.845274 -3.464331 -1.202307
H  5.618904 -2.48767 0.306944
H  5.096323 2.659523 -1.026416
H  6.043869 2.348079 0.475718
H  4.997218 3.779784 0.37996
H  0.095547 -3.409837 2.95616
H  1.416612 -4.643831 2.943777
H  1.77162 -2.913172 3.280985
H  -2.732454 0.767388 0.456439
H  -5.852912 -1.26629 -1.774846
H  -3.49513 3.634684 -0.82276
H  -3.282954 5.130431 0.123273
H  -2.224761 4.803052 -1.308197
H  -4.465886 1.946094 1.820753
H  -7.597015 -0.121931 -0.388652
H  -6.915935 1.494743 1.411264
