program: Gaussian 09
title: 000259684
version: EM64L-G09RevD.01
frameworkgroup: C1[X(C16H11NO4)]
method: RPBEPBE
basis: SDD
operation: Freq
keyword: #p
keyword: freq=noraman
keyword: PBEPBE/SDD
title: #p freq=noraman PBEPBE/SDD
converged: YES YES NO NO
title: Mulliken charges:
elementType: O O O O N C C C C C C C C C C C C C C C C H H H H H H H H H H H
charge: -0.267742 -0.234935 -0.186891 -0.204518 0.013399 0.270385 0.186661 0.152762 0.477789 0.253085 0.213941 -0.708628 -0.405230 -0.342270 -0.439647 -0.373530 -0.254391 -0.247601 -0.247204 0.129093 -0.501770 0.283963 0.232621 0.227521 0.258373 0.271365 0.238782 0.235279 0.239447 0.231801 0.239845 0.258245
chargesum: 0.00000
title: Mulliken charges with hydrogens summed into heavy atoms:
elementType: O O O O N C C C C C C C C C C C C C C C C
charge: -0.267742 -0.234935 -0.186891 -0.204518 0.013399 0.270385 0.186661 0.152762 0.477789 0.253085 0.213941 -0.424665 -0.172610 -0.114750 -0.181274 -0.102165 -0.015610 -0.012322 -0.007757 0.129093 0.228122
polarizability: 3.27270837e+02 -8.86682440e+00 2.22703014e+02 1.08588221e+01 -1.13352319e+01 8.94338992e+01
1716.lowfreq: -3.2152 -0.0004 0.0006 0.0007 1.1779 8.2278 32.9269 59.5468 74.2022
frequency: 32.9147 59.5460 74.2017 82.3832 101.8080 115.1889 127.0431 148.5528 192.8120 205.5401 227.2662 233.7132 267.1575 271.5627 319.5038 333.4825 359.8680 399.9486 432.1246 442.8289 492.6732 500.9139 508.1528 568.3022 589.8069 603.9617 613.0403 640.6366 683.5991 702.4300 709.7912 729.9089 758.0639 767.2207 776.1809 779.0096 804.0842 839.8412 868.2390 880.4331 928.7784 936.5573 942.2754 964.0350 971.4758 990.6104 998.5932 1025.3668 1047.0302 1086.9641 1107.5381 1114.6494 1149.6288 1153.8712 1181.7692 1191.6565 1205.3209 1208.4098 1253.1764 1258.8147 1275.3696 1314.4811 1361.8424 1377.1633 1387.7485 1406.5626 1416.1315 1422.2118 1448.1352 1449.6768 1451.5894 1463.3184 1500.0516 1531.4069 1578.2861 1592.8040 1609.3314 1619.2200 1623.4511 3006.4852 3111.0723 3132.9594 3141.3276 3146.5417 3151.4532 3158.8061 3162.4819 3168.8179 3174.3760 3181.4787
redmass: 5.1478 6.5352 4.4766 7.0186 1.1248 5.0907 3.9356 6.0236 10.9592 5.0105 5.6410 5.5561 5.8642 4.8580 4.5018 7.8693 6.2378 5.7266 3.9925 6.6784 4.6718 4.9146 3.9149 4.1524 5.2853 5.8421 5.9989 6.2204 6.2348 5.6022 8.4646 5.8316 2.3330 2.1588 1.5348 5.8921 5.1571 2.3003 5.5699 1.6354 2.2433 2.6806 1.6210 5.9917 1.4857 1.3870 1.3586 5.0497 2.4619 2.4366 2.4626 1.3032 1.4388 1.6258 1.0742 1.8697 4.6756 1.5985 2.4154 2.3027 1.7591 3.0810 4.5559 7.2943 3.6562 5.0436 2.6289 1.2286 2.5226 3.0352 1.0504 1.0523 3.8010 4.4578 7.4600 6.1787 7.8869 8.6338 6.5229 1.0294 1.1046 1.0863 1.0894 1.0876 1.1051 1.0944 1.0920 1.0958 1.0955 1.0977
irintensity: 2.2360 3.0274 0.4657 1.7973 0.5017 0.4993 1.7157 0.0879 1.9470 3.7112 0.8322 7.5661 3.8360 2.0269 18.9966 0.5039 3.0404 0.4206 6.2466 3.2937 3.9303 1.8138 3.7746 5.4748 1.6657 3.8161 0.3715 11.0673 8.5166 23.7123 13.2519 4.7805 3.5547 19.3291 103.3815 9.2887 14.9614 6.0053 1.8034 1.2493 2.4039 5.4220 14.8743 14.8894 10.8002 1.3896 0.2388 36.3444 65.5497 11.1413 87.8245 11.7179 2.3438 75.1642 0.1003 20.0528 185.6721 149.2811 3.5884 195.8110 11.3026 16.9538 88.3859 44.1587 16.6646 2.6926 10.1590 34.0371 2.5482 5.5304 13.9932 12.3340 19.5145 5.7549 11.2924 37.0546 23.7539 82.4074 20.5085 40.5901 19.8098 0.8974 4.0157 9.3530 18.0134 11.1632 0.6064 10.4883 23.9683 18.2970
temp: 298.150 k
press: 1.00000 atm
elementType: 8 8 8 8 7 6 6 6 6 6 6 6 6 6 6 6 6 6 6 6 6 1 1 1 1 1 1 1 1 1 1 1
symmnumber: 1
zpe: 612038.5 jmol-1
zpe.correction: 0.233113 hartree
zpe.thermalcorrener: 0.250222 hartree
zpe.thermalcorrenthalpy: 0.251167 hartree
zpe.thermalcorrgfe: 0.187860 hartree
zpe.sumelectzpe: -970.433065 hartree
zpe.sumelectthermal: -970.415956 hartree
zpe.sumelectthermalent: -970.415011 hartree
zpe.sumelectthermalfe: -970.478318 hartree
dipole: 3.7223 4.3859 -0.0239
dipole: 5.7526
quadrupole: -89.7754 -114.2065 -129.1514
quadrupole: -8.7641 -0.9117 0.4626
quadrupole: 21.2691 -3.1621 -18.1070 -8.7641 -0.9117 0.4626
hfenergy: -970.666178 hartree
pointgroup: C01 [X(C16H11N1O4)]
dipole: -1.4840419 -1.7087625 0.0052234 debye
polarizability: 324.2729901|-7.9049626|221.2708488|-28.0204502|19.1289958|93.863911 unknown
InChI: InChI=1S/C16H11NO4/c1-21-16(18)13-8-4-7-12-11-6-3-2-5-10(11)9-14(15(12)13)17(19)20/h2-9H,1H3
charge 0 multiplicity 1
32 atoms
O  3.896998 -0.671668 -0.606049
O  2.902785 0.690766 0.999269
O  1.124967 3.356788 -0.063848
O  2.007797 1.789731 -1.459936
N  1.150241 2.173221 -0.570724
C  -0.943661 -1.031562 -0.23256
C  0.256462 -0.223349 -0.237697
C  -2.258696 -0.414552 -0.018005
C  -2.342327 1.010503 0.175959
C  0.075078 1.219616 -0.190296
C  1.535754 -0.883687 -0.276046
C  -1.154768 1.805446 0.048734
C  -0.818316 -2.442146 -0.422183
C  -3.474338 -1.162204 0.035908
C  -3.603807 1.635158 0.425424
C  1.609407 -2.271059 -0.488971
C  0.429436 -3.048957 -0.591474
C  -4.703834 -0.535183 0.285299
C  -4.774697 0.873437 0.486048
C  2.802644 -0.17684 0.09743
C  5.195568 -0.033678 -0.277265
H  -1.220931 2.897133 0.089044
H  -1.713042 -3.06943 -0.436617
H  -3.464533 -2.245686 -0.109731
H  -3.637026 2.721331 0.565869
H  2.593856 -2.743431 -0.541829
H  0.499977 -4.12814 -0.759468
H  -5.619018 -1.135565 0.327378
H  -5.739803 1.351916 0.681051
H  5.917535 -0.505274 -0.95819
H  5.457924 -0.219667 0.77794
H  5.13037 1.052732 -0.451659
