program: Gaussian 09
title: 000259655
version: EM64L-G09RevD.01
frameworkgroup: C1[X(C9H7NO3)]
method: RPBEPBE
basis: SDD
operation: Freq
keyword: #pfreq=noraman
keyword: PBEPBE/SDD
title: #p freq=noraman PBEPBE/SDD
converged: YES YES NO NO
title: Mulliken charges:
elementType: O O O N C C C C C C C C C H H H H H H H
charge: -0.423403 -0.203867 -0.196325 0.019336 0.444948 -0.321368 -0.465630 0.391367 -0.432728 -0.368874 -0.179610 0.259435 -0.475991 0.220989 0.323934 0.245117 0.291248 0.243047 0.346055 0.282320
chargesum: 0.00000
title: Mulliken charges with hydrogens summed into heavy atoms:
elementType: O O O N C C C C C C C C C
charge: -0.077347 -0.203867 -0.196325 0.019336 0.444948 -0.100379 -0.141696 0.391367 -0.187611 -0.077626 0.063437 0.259435 -0.193671
polarizability: 1.44371508e+02 4.92179076e+00 1.21621161e+02 4.01828439e+00 2.57165967e+00 7.40336462e+01
1716.lowfreq: -11.2550 -8.6638 -6.1286 -0.0008 -0.0005 -0.0004 17.9426 50.1251 83.5403
frequency: 17.7465 50.1198 83.5333 123.5016 162.9426 187.8860 230.1470 276.5812 299.4472 355.1834 379.9017 386.7544 428.0141 502.8271 529.2612 565.8674 630.6185 645.5289 663.0054 675.8160 690.6829 704.4576 762.0190 816.7713 886.0880 928.9132 934.9735 954.4208 963.3085 989.2530 999.6277 1080.4853 1087.9628 1174.6395 1187.8974 1204.7379 1220.4568 1258.5548 1304.2518 1345.8728 1375.2295 1402.1822 1436.1607 1474.3506 1592.5756 1613.7540 2151.4889 2941.4663 3130.3839 3160.6184 3178.5577 3187.8554 3425.7592 3535.3268
redmass: 5.4044 11.2824 4.9029 7.7578 5.4562 4.5450 5.1649 5.4219 1.1356 5.0586 6.2001 6.7969 3.5103 7.6036 6.4067 6.5118 4.7102 1.4568 5.5243 1.2568 2.2495 6.4771 8.7104 1.5176 5.1151 1.6862 4.0365 1.5132 2.8422 6.2337 1.3547 1.6458 1.8741 1.1871 1.8658 1.4017 4.3906 1.3616 1.3343 1.5949 11.0456 6.1741 2.6268 2.7660 6.5767 7.0580 6.0019 1.0829 1.0897 1.0929 1.0925 1.0965 1.1612 1.0660
irintensity: 0.2985 0.2160 0.0770 0.2350 3.6192 2.5090 5.2631 3.7587 184.9836 9.3840 3.3678 2.6112 1.0400 5.0521 8.4026 2.0623 1.7318 52.1533 54.0896 54.5733 30.2576 18.4347 7.2583 44.5206 13.8712 26.0880 13.2397 36.6222 58.5001 0.3619 0.6284 32.2653 12.9373 4.0380 34.3788 71.9769 184.2020 9.3106 1.6535 39.8321 117.9033 1.8175 19.4261 21.1508 5.1934 1.5514 5.0323 31.2704 6.4126 10.8354 6.6730 4.8314 61.7604 11.9637
temp: 298.150 k
press: 1.00000 atm
elementType: 8 8 8 7 6 6 6 6 6 6 6 6 6 1 1 1 1 1 1 1
symmnumber: 1
zpe: 366630.1 jmol-1
zpe.correction: 0.139642 hartree
zpe.thermalcorrener: 0.151579 hartree
zpe.thermalcorrenthalpy: 0.152524 hartree
zpe.thermalcorrgfe: 0.099951 hartree
zpe.sumelectzpe: -626.489396 hartree
zpe.sumelectthermal: -626.477458 hartree
zpe.sumelectthermalent: -626.476514 hartree
zpe.sumelectthermalfe: -626.529086 hartree
dipole: -2.7949 5.1060 0.0892
dipole: 5.8216
quadrupole: -87.2654 -72.3332 -68.6829
quadrupole: 3.3831 3.0305 4.2767
quadrupole: -11.1716 3.7606 7.4110 3.3831 3.0305 4.2767
hfenergy: -626.6290376 hartree
pointgroup: C01 [X(C9H7N1O3)]
dipole: -1.0694565 2.0028996 -0.3008005 debye
dipolederiv: -0.6884534 0.0366882 0.1461908 0.0431423 -0.2458996 0.1727172 0.1932381 0.1264867 -0.7122046 -0.8889005 -0.0248175 0.0796298 0.0614527 -0.4580144 0.0724018 0.0696515 0.0739498 -0.2580442 -0.5080139 0.0512495 0.014481 0.0529405 -0.76111 0.1772919 0.0250881 0.1625352 -0.2713637 1.4333221 -0.2634135 -0.0610471 -0.3850191 1.2021541 -0.2963982 -0.0503068 -0.2732512 0.2773228 0.1235328 0.132117 0.008665 0.1376617 -0.1609371 0.0524274 -0.0160737 -0.0038722 -0.1879808 0.7082411 0.0785291 0.03036 0.0730147 0.4043686 -0.0257 0.0499052 0.0727082 0.8729132 -0.0325049 -0.2105151 0.0308617 0.0345054 -0.035442 -0.0209473 -0.0526787 0.0124223 -0.0748623 -0.2490758 0.2586443 -0.0396619 0.3180066 -0.1726988 0.0452848 -0.0431364 0.0419232 0.0585219 0.0309334 -0.0892711 -0.0042573 -0.0435508 0.0648387 -0.04579 0.0025111 -0.0642276 -0.1045455 -0.0273444 0.0382565 -0.0338834 -0.2415341 -0.0005483 -0.0125791 0.0596286 -0.0396286 -0.1058233 -0.2411063 0.0791549 -0.012012 0.1051854 0.1371432 -0.0824916 -0.0207705 -0.0859019 -0.0858175 -0.1872789 -0.0405356 -0.0447744 -0.0701353 -0.1125064 -0.0458089 0.0929595 0.0458999 -0.138752 -0.3584642 -0.0286862 -0.0054953 -0.0782399 -0.2686883 -0.0132047 -0.1175236 -0.0539866 -0.2895656 -0.0028714 0.0341669 -0.0128952 0.0847306 -0.1400743 0.0155878 -0.045601 -0.0150122 -0.0352369 0.1632413 0.002895 0.0082389 -0.0314765 0.0854746 0.0130826 0.0057568 0.0178149 0.1534477 -0.0094458 0.1122336 -0.0044387 0.0849604 0.040735 0.0239719 -0.0047859 0.0147972 0.1353775 0.0470139 -0.036871 0.0269198 -0.0075792 0.1353955 0.0113055 0.0144277 0.0158353 0.1666712 0.0652652 -0.0348844 0.0186567 -0.0312077 -0.0651162 0.065511 0.0234209 0.0684294 0.1343255 0.3461806 -0.0964518 -0.1354843 -0.1157691 0.1129857 -0.0941315 -0.1861001 -0.1102058 0.2304246 0.275729 0.0015111 -0.010054 0.0089112 0.2379401 -0.0125306 0.0003894 -0.0067159 0.2351919 unknown
polarizability: 144.4843876|5.2131258|121.0233899|3.4988578|-5.2696752|74.518537 unknown
InChI: InChI=1S/C9H7NO3/c1-2-9(11)7-4-3-5-8(6-7)10(12)13/h1,3-6,9,11H
charge 0 multiplicity 1
20 atoms
O  -2.448647 -0.44882 1.762762
O  3.755049 -0.592621 -0.087173
O  2.22057 -2.134022 0.597354
N  2.547197 -0.954819 0.190088
C  -0.886138 0.639297 0.157219
C  -2.339314 0.253197 0.463394
C  0.138539 -0.322939 0.310695
C  1.46525 0.054803 0.030018
C  -0.560354 1.949872 -0.265566
C  1.811364 1.356194 -0.399063
C  0.780762 2.305219 -0.544421
C  -2.893575 -0.650631 -0.561141
C  -3.357215 -1.373725 -1.443132
H  -2.953229 1.180944 0.480259
H  -0.089142 -1.340262 0.641055
H  -1.355926 2.695815 -0.381497
H  2.857596 1.596447 -0.604476
H  1.020467 3.321522 -0.872348
H  -2.047943 0.131464 2.462281
H  -3.758909 -2.017032 -2.20511
