program: Gaussian 09
title: 000259654
version: EM64L-G09RevD.01
frameworkgroup: C1[X(C11H14O)]
method: RPBEPBE
basis: SDD
operation: Freq
keyword: #pfreq=noraman
keyword: PBEPBE/SDD
title: #p freq=noraman PBEPBE/SDD
converged: YES YES NO NO
title: Mulliken charges:
elementType: O C C C C C C C C C C C H H H H H H H H H H H H H H
charge: -0.452116 0.185097 0.401658 -0.593144 0.179985 0.524184 -0.677430 -0.574994 -0.852937 -0.818092 -0.033326 -0.594738 0.202286 0.247444 0.234533 0.217885 0.251533 0.228583 0.226681 0.227569 0.227432 0.226450 0.236982 0.354913 0.213894 0.209670
chargesum: 0.00000
title: Mulliken charges with hydrogens summed into heavy atoms:
elementType: O C C C C C C C C C C C
charge: -0.097203 0.185097 0.401658 -0.143415 0.179985 0.524184 -0.442897 -0.357109 -0.146140 -0.136641 0.203656 -0.171175
polarizability: 1.64005663e+02 -9.83949986e+00 1.28459322e+02 -3.72224466e+00 1.02687248e+00 7.49247510e+01
1716.lowfreq: -15.7737 -11.2398 -0.0006 -0.0001 0.0005 8.0071 13.2204 38.2247 65.0946
frequency: -12.7497 37.9597 65.0516 102.9248 151.2425 175.8251 202.3121 227.6014 270.0748 284.6251 307.0956 340.6639 380.2478 391.8909 475.3893 500.3335 539.9961 549.5850 563.5602 589.4190 623.0159 726.1609 797.0035 828.7345 868.9563 881.0731 916.4784 931.8748 956.5733 969.2641 1007.1778 1015.7700 1026.5692 1043.3506 1047.1902 1100.1423 1138.9316 1172.1203 1208.6213 1217.1658 1267.3067 1279.6993 1295.0112 1322.7904 1382.5932 1396.7642 1398.2628 1411.4655 1420.5984 1456.2720 1469.5952 1470.8123 1476.7775 1481.1602 1510.5277 1596.4491 1625.2990 1650.5294 2972.1434 2974.4960 2997.5106 3049.5335 3051.4208 3055.6978 3081.2516 3084.1969 3085.1537 3097.0457 3102.4004 3122.8546 3191.0192 3586.0296
redmass: 1.0380 3.3142 3.7878 2.5416 1.0903 2.7361 2.8782 3.2509 2.6317 3.3109 2.8843 1.1773 3.0840 2.5326 2.7718 3.5496 2.9799 3.9040 5.2135 3.1370 1.8791 3.0737 3.1935 1.5237 1.3188 1.8451 1.9722 1.3564 2.2484 3.2912 1.1476 1.5059 1.7979 1.5410 1.5677 1.7921 2.5514 1.3141 1.6544 1.5770 1.3586 1.2547 1.4415 4.6527 3.8737 1.3002 1.3689 2.6658 1.1959 1.0972 1.0536 1.0487 1.1472 1.2356 2.5460 6.4449 6.6239 4.6552 1.0380 1.0374 1.0590 1.0963 1.0977 1.1007 1.0605 1.0983 1.0981 1.0912 1.0946 1.0914 1.1141 1.0659
irintensity: 0.3986 0.0246 0.4868 0.0443 1.2534 4.5223 0.1963 0.6302 0.7971 2.3582 6.2069 124.3947 7.0803 3.3686 2.3607 2.7447 3.7521 3.7951 7.1204 5.6685 8.4522 8.1208 8.2753 33.7858 4.1081 17.4160 2.4975 61.9275 39.5011 13.0867 17.3153 9.6998 27.6614 3.2759 21.1789 101.5245 16.1972 28.9977 17.7723 14.7581 31.5450 2.4663 4.9892 15.9383 16.5348 8.4591 7.8224 7.1738 4.1368 19.7938 4.2155 25.9774 0.2575 43.1856 14.3915 54.3449 23.5752 30.5020 30.9986 40.0004 23.5671 14.5548 24.5277 6.4082 14.6229 14.2481 21.8551 24.2600 10.6412 17.7410 32.3035 26.5216
temp: 298.150 k
press: 1.00000 atm
elementType: 8 6 6 6 6 6 6 6 6 6 6 6 1 1 1 1 1 1 1 1 1 1 1 1 1 1
symmnumber: 1
zpe: 568194.1 jmol-1
zpe.correction: 0.216414 hartree
zpe.thermalcorrener: 0.228574 hartree
zpe.thermalcorrenthalpy: 0.229518 hartree
zpe.thermalcorrgfe: 0.178102 hartree
zpe.sumelectzpe: -501.880379 hartree
zpe.sumelectthermal: -501.868219 hartree
zpe.sumelectthermalent: -501.867275 hartree
zpe.sumelectthermalfe: -501.918691 hartree
dipole: -1.8136 0.3933 0.1509
dipole: 1.8619
quadrupole: -68.6687 -64.0497 -74.5308
quadrupole: -6.0338 -1.3659 1.9005
quadrupole: 0.4144 5.0334 -5.4478 -6.0338 -1.3659 1.9005
hfenergy: -502.0967925 hartree
pointgroup: C01 [X(C11H14O1)]
dipole: 0.6928239 0.2323102 -0.0509593 debye
dipolederiv: -0.3524858 0.5058409 0.0125958 0.4496755 -1.1342852 -0.1401744 -0.0146888 -0.1244763 -0.4045061 0.2120569 -0.0782731 -0.0292331 0.1464787 -0.3553559 -0.0105631 -0.0994865 -0.0198325 -0.1657418 0.2011124 0.1084077 -0.0522959 0.0176568 0.3125048 -0.0186735 -0.0547022 -0.0257477 0.0111067 -0.0588399 -0.0135069 -0.0663856 -0.0688332 0.0891541 -0.0394912 -0.1777683 -0.0193573 0.0445296 0.2805968 -0.3548776 -0.0616044 -0.3676298 1.0732546 0.1250086 -0.0367811 0.1004442 0.0810533 0.3709899 -0.0287141 -0.0773176 0.1234548 0.1887779 -0.0126481 -0.0717868 0.0086493 0.0184229 -0.3519112 -0.1239287 0.014114 -0.1671382 -0.1129903 0.0361434 0.030411 0.0360784 -0.2272704 -0.3134023 0.2639254 0.0182126 0.0568189 -0.1529668 -0.0107516 0.0180882 -0.0522185 -0.2465469 -0.0430196 -0.1449276 -0.0080279 -0.0839153 -0.0655914 0.0216166 -0.0106452 0.0372367 0.0482942 -0.1159021 -0.0071043 0.0371086 -0.0821323 0.0711048 0.013477 0.0363613 0.0009526 0.0626379 0.0576432 0.158405 0.158848 0.1623172 0.0329774 -0.0895718 0.4272746 -0.0296525 0.1567598 -0.384297 0.1009483 0.0638928 0.0737027 -0.1736505 -0.2011605 0.0037729 -0.1901238 -0.0241407 -0.0150057 -0.050155 0.025337 -0.0620493 -0.0336877 0.1440148 0.015079 0.072302 -0.0039076 0.0506035 0.0041695 -0.0124185 0.0900043 0.0009234 -0.0858792 -0.0191179 -0.0693603 0.0223869 0.0168636 0.0772376 0.0244533 0.0985936 -0.0768667 -0.0226734 0.0317655 -0.0231421 0.148797 0.0296301 -0.0740395 0.0221235 -0.090223 -0.112259 0.0081836 0.0265896 0.0120155 0.1626766 -0.0262282 -0.0690415 -0.0891309 -0.0489299 0.0607832 0.016511 -0.0965084 -0.0214885 0.0204656 -0.0107615 0.1707146 0.0306587 0.0666053 -0.0594311 -0.0223083 0.0316336 -0.0497306 0.0962834 0.0524471 -0.054949 0.0951991 -0.0396106 0.0370474 -0.0042112 0.099906 0.060272 -0.0936496 0.0034935 -0.0049041 0.0343622 -0.0343541 0.0402915 0.1165456 0.1096239 0.0935911 -0.073077 -0.0646537 -0.0395858 -0.0497171 -0.0725739 0.048868 -0.091138 -0.1195563 -0.0803354 -0.0178325 0.0460846 0.0219628 0.0121568 0.1369133 -0.1157372 -0.0310782 0.015605 -0.0098834 0.1025907 0.110588 -0.0781644 0.0086097 -0.0430476 0.0057518 0.116599 -0.0368653 0.0844055 -0.020412 0.1227748 -0.1931329 0.0297505 -0.109059 0.3039946 0.024501 0.0497523 0.037102 0.3593121 0.0533161 -0.0432059 -0.1231638 -0.0772139 0.1161087 0.0416486 -0.1713381 0.0318549 -0.0487334 0.1283065 -0.0531015 -0.0181277 -0.075511 0.0112796 0.116073 0.0133821 0.1404449 -0.0094981 unknown
polarizability: 161.498539|13.5379377|130.9472657|-3.2887598|1.2415778|74.9439305 unknown
InChI: InChI=1S/C11H14O/c1-4-5-10-9(3)6-8(2)7-11(10)12/h4,6-7,12H,1,5H2,2-3H3
charge 0 multiplicity 1
26 atoms
O  -0.406619 2.541948 0.41734
C  -0.438146 0.133624 0.386305
C  0.248826 -1.099639 0.204794
C  -1.933088 0.203676 0.686806
C  0.308563 1.333233 0.249254
C  2.375471 0.104321 -0.210347
C  1.637986 -1.09679 -0.087072
C  1.690477 1.331182 -0.0381
C  -0.490748 -2.421652 0.322402
C  3.862561 0.087686 -0.521798
C  -2.770539 0.202103 -0.584917
C  -3.768419 -0.674446 -0.862709
H  -2.240061 -0.640379 1.330613
H  -2.135406 1.139605 1.240473
H  2.153431 -2.055526 -0.221085
H  2.236486 2.280882 -0.131405
H  -1.34804 -2.465814 -0.374506
H  0.178278 -3.269573 0.098251
H  -0.895193 -2.573921 1.341889
H  4.084185 0.621294 -1.465503
H  4.448304 0.580962 0.276923
H  4.238424 -0.944571 -0.624629
H  -2.518508 0.989539 -1.310504
H  0.200435 3.317255 0.326555
H  -4.342047 -0.616368 -1.794799
H  -4.046715 -1.470332 -0.159634
