program: Gaussian 09
title: 000259683
version: EM64L-G09RevD.01
frameworkgroup: C1[X(C15H9BrINO4)]
method: RPBEPBE
basis: SDD
operation: Freq
keyword: #p
keyword: freq=noraman
keyword: PBEPBE/SDD
title: #p freq=noraman PBEPBE/SDD
converged: YES YES NO NO
title: Mulliken charges:
elementType: I Br O O O O N C C C C C C C C C C C C C C C H H H H H H H H H
charge: 0.105026 0.034931 -0.258195 -0.254097 -0.194628 -0.181373 0.034592 0.499140 0.194417 0.189936 -0.464073 0.241680 -0.426876 -0.302165 -0.203605 -0.379796 0.498602 -0.532790 -0.319312 -0.169911 -0.240452 -0.222502 0.285413 0.278286 0.242919 0.247216 0.276480 0.285862 0.252811 0.240896 0.241566
chargesum: 0.00000
title: Mulliken charges with hydrogens summed into heavy atoms:
elementType: I Br O O O O N C C C C C C C C C C C C C C C
charge: 0.105026 0.034931 -0.258195 -0.254097 -0.194628 -0.181373 0.034592 0.499140 0.194417 0.189936 -0.178660 0.241680 -0.426876 -0.023878 0.286529 -0.103317 0.498602 -0.532790 -0.033450 0.082900 0.000444 0.019065
polarizability: 3.15327549e+02 -3.75205208e+01 2.92761218e+02 -1.36801706e+01 1.09226734e+01 1.09111970e+02
1716.lowfreq: -0.0005 -0.0005 -0.0004 0.5085 2.7613 5.0957 15.4653 21.7745 37.6905
frequency: 15.3380 21.6807 37.6767 45.5648 58.5040 77.3787 84.8210 87.9654 106.7380 134.3432 159.1624 190.2993 206.9994 220.4126 241.1567 267.0889 271.1094 288.6970 326.2711 359.9334 390.8090 412.1433 440.9594 445.1049 505.3718 527.1997 564.9431 584.3141 616.9942 637.8371 659.6864 672.5666 680.0524 709.5478 724.5880 730.1085 750.5199 782.8679 789.3688 806.9853 836.2983 856.5469 862.2868 875.4116 879.2186 901.0211 953.6655 969.0733 990.2723 992.7123 1004.1195 1044.8617 1068.5101 1074.1324 1113.5927 1125.2371 1171.0892 1178.3486 1195.3642 1216.1592 1229.9426 1265.9092 1280.3447 1315.4678 1348.6177 1362.3980 1366.0967 1372.8662 1411.2126 1416.5901 1445.1902 1463.5813 1484.6532 1557.4244 1588.6010 1598.9212 1618.3358 1638.2239 3014.1307 3089.0764 3116.2310 3141.6994 3159.9234 3175.9474 3176.8391 3194.7437 3202.6499
redmass: 12.0973 10.0483 7.8783 13.6692 10.7046 2.7108 6.0850 16.7132 7.5336 10.1148 5.4089 8.5417 7.2029 9.0411 9.2359 9.5268 8.7408 7.0590 10.9165 7.6630 3.8535 5.5724 3.9668 3.2970 3.8448 7.1326 6.6890 8.1422 6.9894 7.1360 9.1308 7.8455 9.4907 4.8278 4.4925 6.4235 1.4645 4.4055 5.5044 5.6038 8.3550 1.4231 1.3726 3.7067 1.4448 1.7946 1.4062 6.7469 1.3474 7.3994 3.2905 2.1875 1.4928 4.0635 1.8603 1.0568 1.8487 1.1602 12.7981 2.2182 1.3831 4.1111 2.0024 1.4881 3.4416 2.7601 1.8057 9.8649 5.9653 2.2230 2.5550 2.7520 1.2559 5.4946 6.6456 8.9676 8.9978 8.6620 1.0587 1.0860 1.1133 1.0867 1.0927 1.0977 1.0937 1.0939 1.0949
irintensity: 0.3824 0.9732 1.6545 0.5208 0.9644 10.7059 0.7784 1.5705 1.7783 0.5357 1.5574 2.8852 1.0013 0.5361 3.4268 0.7571 0.8357 2.1323 0.2150 0.8286 2.4559 14.0021 11.1892 11.0760 1.1713 3.4607 23.7423 10.4025 6.2024 25.4709 4.5726 14.6360 0.7477 0.5010 7.6364 8.4868 47.9671 36.4723 21.5172 5.0561 29.7382 7.9660 21.9024 4.2619 28.8888 15.5393 7.7220 189.6008 0.5796 51.5079 1.9217 5.9656 6.7966 51.9750 2.1730 1.4434 15.4363 3.8593 175.5608 27.2031 10.5987 183.7534 62.3032 41.5715 16.0978 2.2522 1.4334 135.9720 38.8067 25.2375 1.8540 238.6373 31.6568 11.5598 12.6321 3.8339 15.8525 20.9176 121.3189 5.9147 24.3824 1.8658 11.5767 14.5243 1.2515 0.9130 3.9359
temp: 298.150 k
press: 1.00000 atm
elementType: 53 35 8 8 8 8 7 6 6 6 6 6 6 6 6 6 6 6 6 6 6 6 1 1 1 1 1 1 1 1 1
symmnumber: 1
zpe: 538179.9 jmol-1
zpe.correction: 0.204982 hartree
zpe.thermalcorrener: 0.224855 hartree
zpe.thermalcorrenthalpy: 0.225799 hartree
zpe.thermalcorrgfe: 0.151569 hartree
zpe.sumelectzpe: -955.929951 hartree
zpe.sumelectthermal: -955.910078 hartree
zpe.sumelectthermalent: -955.909134 hartree
zpe.sumelectthermalfe: -955.983364 hartree
dipole: 0.8292 2.9934 -2.8322
dipole: 4.2035
quadrupole: -124.2146 -140.0398 -160.4007
quadrupole: -18.7374 -0.8404 8.8418
quadrupole: 17.3371 1.5119 -18.8490 -18.7374 -0.8404 8.8418
hfenergy: -956.1349332 hartree
pointgroup: C01 [X(C15H9Br1I1N1O4)]
dipole: -0.1704083 0.9640862 -1.3328465 debye
polarizability: 339.1810071|-20.3536215|264.3563843|-13.1043406|-26.9731496|113.6633455 unknown
InChI: InChI=1S/C15H9BrINO4/c16-11-7-15-14(21-8-22-15)6-10(11)13(18(19)20)5-9-3-1-2-4-12(9)17/h1-7H,8H2
charge 0 multiplicity 1
31 atoms
I  2.097498 3.146051 -0.759243
Br -1.309361 -3.451256 0.029897
O  -3.869372 2.103099 -0.324951
O  -5.282691 0.173285 -0.536157
O  1.7574 -1.976458 1.708614
O  -0.165397 -1.162328 2.621263
N  0.654102 -1.313907 1.634986
C  -1.185683 -0.515998 0.123082
C  -3.112533 0.916074 -0.182958
C  -3.946094 -0.216169 -0.308222
C  -1.742383 0.798765 0.03094
C  0.280584 -0.649639 0.353464
C  -2.045164 -1.637643 -0.018868
C  -3.441215 -1.515514 -0.235383
C  -5.287934 1.6572 -0.381784
C  1.203055 -0.040048 -0.454305
C  2.676266 0.078944 -0.415388
C  3.294491 1.348286 -0.6280
C  3.537696 -1.054209 -0.313079
C  4.693342 1.495587 -0.707732
C  4.936492 -0.920596 -0.413411
C  5.5183 0.351442 -0.605229
H  -1.104621 1.677503 0.154766
H  -4.084901 -2.389727 -0.345905
H  -5.787093 1.914993 0.569899
H  -5.771035 2.105512 -1.263157
H  0.738015 0.510434 -1.285599
H  3.087454 -2.036749 -0.166036
H  5.137665 2.484562 -0.848359
H  5.569243 -1.810482 -0.336889
H  6.60527 0.463883 -0.676853
