program: Gaussian 09
title: 000259825
version: EM64L-G09RevD.01
frameworkgroup: C1[X(C17H20N4O8)]
method: RPBEPBE
basis: SDD
operation: Freq
keyword: #p
keyword: freq=noraman
keyword: PBEPBE/SDD
title: #p freq=noraman PBEPBE/SDD
converged: YES YES NO NO
title: Mulliken charges:
elementType: O O O O O O O O N N N N C C C C C C C C C C C C C C C C C H H H H H H H H H H H H H H H H H H H H
charge: -0.276226 -0.266257 -0.255945 -0.251089 -0.235176 -0.266770 -0.207349 -0.248804 -0.192968 -0.034898 -0.391729 -0.007958 -0.131426 -0.134977 -0.090035 -0.120901 -0.423833 -0.314530 0.309050 -0.193785 -0.129411 0.296775 0.342119 0.026506 -0.752220 -0.752849 -0.246396 0.290730 -0.752638 0.302518 0.334752 0.274337 0.302640 0.237739 0.253548 0.260531 0.228651 0.280756 0.380811 0.252907 0.254200 0.274896 0.258473 0.258369 0.266909 0.241495 0.253790 0.247827 0.247844
chargesum: 0.00000
title: Mulliken charges with hydrogens summed into heavy atoms:
elementType: O O O O O O O O N N N N C C C C C C C C C C C C C C C C C
charge: -0.276226 -0.266257 -0.255945 -0.251089 -0.235176 -0.266770 -0.207349 -0.248804 -0.192968 -0.034898 -0.010918 -0.007958 0.171091 0.199775 0.184302 0.181738 0.067454 0.174652 0.309050 0.086971 -0.129411 0.296775 0.342119 0.026506 0.029783 0.030901 -0.004901 0.290730 -0.003177
polarizability: 3.02459070e+02 1.56416178e+01 2.34728701e+02 3.39359677e+00 5.97945385e+00 1.64067980e+02
1716.lowfreq: -7.6509 -2.3233 -0.0011 -0.0008 -0.0007 6.6767 10.8664 18.5808 23.2033
frequency: 10.5738 18.3752 23.1317 28.4291 33.9825 39.7941 46.5859 53.4378 59.1911 62.6684 73.5714 75.1453 80.0613 89.9305 105.9900 112.4335 119.1960 140.8884 155.2797 171.5702 203.9686 220.2679 221.6943 235.9431 262.5955 277.2240 278.3841 298.6772 327.6132 346.9305 358.7813 392.7396 423.6340 439.1019 485.0943 490.1457 500.6683 535.0195 567.6376 569.7118 576.3058 578.3790 592.8221 610.6284 624.9611 626.1344 637.0056 658.1582 683.6932 730.6278 752.1184 768.2712 774.0542 784.5577 793.3711 795.1680 813.8608 841.2996 847.4103 864.1126 866.2083 902.2820 935.0912 939.9383 945.5473 960.9492 968.5799 980.0898 996.1970 1002.5660 1007.6402 1015.3541 1029.4384 1043.4618 1044.1938 1046.9501 1057.8189 1073.9797 1093.6316 1098.8007 1120.7453 1162.2136 1174.0416 1183.8109 1196.3630 1201.4396 1214.8235 1215.5445 1241.8239 1261.9755 1272.3321 1279.4743 1292.7749 1298.5739 1306.7338 1321.5967 1335.9899 1349.0163 1355.3852 1364.1002 1369.8918 1381.1535 1387.3511 1391.1007 1391.8691 1421.5692 1449.5148 1450.9028 1451.1443 1452.1955 1452.7168 1453.1394 1455.6009 1464.7566 1514.0501 1542.1210 1596.0235 1629.1084 1638.1968 1650.8480 1658.7009 3006.7024 3007.4526 3007.7612 3008.6513 3024.1730 3025.4228 3038.3321 3071.3193 3074.1039 3086.2174 3093.5576 3099.2622 3102.4744 3125.5626 3126.3463 3142.4475 3146.6954 3147.5808 3267.5934 3326.3362
redmass: 6.1814 7.1079 1.0500 5.6613 6.1113 2.2414 1.7042 3.3115 4.0860 1.9115 3.2168 4.3137 2.4862 6.6529 4.9641 6.5539 4.0964 7.0231 4.9791 4.3755 6.7284 7.0248 5.5402 5.7291 6.1664 4.6898 3.0486 6.0994 7.2506 4.4696 6.6177 3.7849 4.0210 3.8136 5.5681 6.2958 3.5291 3.4744 3.3741 3.5971 3.5091 4.7470 6.8175 6.1301 4.3381 4.6662 6.1376 12.2324 7.3808 5.5285 2.2161 3.1447 4.9817 4.5958 4.1966 2.1910 4.2594 2.1065 1.5384 2.8853 5.0395 1.4111 7.7889 4.3323 3.8534 4.2810 3.8670 2.8156 2.4630 2.4234 2.4140 3.3653 2.8059 1.6760 1.6664 1.6721 3.9181 3.3691 2.1846 2.4564 2.4536 2.8318 2.3345 2.9166 2.6933 3.3810 1.2724 3.2324 1.2021 2.7798 1.3088 1.3023 1.2005 1.4212 1.3760 3.1461 1.3867 1.5794 1.3813 1.7805 1.9885 1.3352 1.3113 1.2345 1.2399 3.5881 1.0611 1.0458 1.0613 1.0786 1.0655 1.0546 1.0567 1.0935 8.7760 2.7171 4.9023 11.8622 9.2616 8.8904 9.6172 1.0597 1.0382 1.0378 1.0396 1.0637 1.0860 1.0872 1.0886 1.0984 1.0882 1.0968 1.0947 1.0928 1.1038 1.0925 1.1021 1.1028 1.1009 1.0985 1.0852
irintensity: 0.9841 3.0462 0.5908 0.7070 1.8726 1.5037 1.4333 1.0602 6.7433 0.4357 1.0207 1.2537 0.5698 2.5048 2.9508 1.7743 1.6845 3.2094 2.3043 4.4048 3.2215 2.7783 5.4669 3.9092 4.9553 10.0957 10.1132 1.8967 6.4082 12.2825 0.9819 11.5143 20.1891 2.8015 3.1456 5.9381 1.1030 3.7737 1.9925 3.4200 8.2110 0.6423 2.2717 12.7950 17.5079 17.4517 2.9567 4.8223 20.6435 9.2486 15.3736 29.9479 16.2138 40.1870 4.7287 10.7122 37.5007 59.5950 38.4661 45.9898 10.7363 0.4516 52.5425 48.3266 20.7543 45.3141 10.8088 16.4518 146.0136 78.3760 29.8170 62.7550 26.8523 11.1991 11.6091 18.9853 193.8388 32.0309 64.3021 36.0442 15.8018 2.5538 46.8359 327.0972 155.5344 344.4043 12.9581 149.0434 9.6645 3.0900 9.8793 7.8021 7.5615 0.8124 6.6441 65.1070 9.4880 4.2421 10.9219 20.5908 32.2063 19.2513 37.9347 94.2423 18.2104 1.7513 25.1054 14.9067 23.6408 5.7383 24.6961 23.1145 11.6286 24.6757 231.6880 147.7740 59.8585 589.0709 56.9330 163.9239 146.5951 3.4292 1.8523 0.1388 0.0647 19.5171 18.9024 6.2092 9.1702 9.0712 2.8938 2.4401 7.2960 3.7457 8.7722 18.0518 8.4444 3.3870 5.4792 1.6863 676.7840
temp: 298.150 k
press: 1.00000 atm
elementType: 8 8 8 8 8 8 8 8 7 7 7 7 6 6 6 6 6 6 6 6 6 6 6 6 6 6 6 6 6 1 1 1 1 1 1 1 1 1 1 1 1 1 1 1 1 1 1 1 1
symmnumber: 1
zpe: 966441.7 jmol-1
zpe.correction: 0.368098 hartree
zpe.thermalcorrener: 0.397187 hartree
zpe.thermalcorrenthalpy: 0.398131 hartree
zpe.thermalcorrgfe: 0.301841 hartree
zpe.sumelectzpe: -1478.450488 hartree
zpe.sumelectthermal: -1478.421399 hartree
zpe.sumelectthermalent: -1478.420455 hartree
zpe.sumelectthermalfe: -1478.516745 hartree
dipole: 12.3788 7.4509 2.7797
dipole: 14.7132
quadrupole: -230.7295 -156.7851 -173.4683
quadrupole: -10.0718 -22.4164 -9.6935
quadrupole: -43.7352 30.2092 13.5260 -10.0718 -22.4164 -9.6935
hfenergy: -1478.8185861 hartree
pointgroup: C01 [X(C17H20N4O8)]
dipole: 3.9845189 1.6973736 -3.8406347 debye
polarizability: 286.5170258|-6.9744215|174.5065238|-35.5562847|-24.4886505|240.2322013 unknown
InChI: InChI=1S/C17H20N4O8/c1-8(22)26-5-4-11-13(27-9(2)23)14(28-10(3)24)17(29-11)21-7-20-12-15(21)18-6-19-16(12)25/h6-7,11,13-14,17-18H,4-5H2,1-3H3
charge 0 multiplicity 1
49 atoms
O  0.950899 -1.093548 -0.093443
O  0.769841 1.3322 1.933929
O  0.385337 1.522081 -1.749678
O  4.86776 -1.402602 -1.780191
O  0.139722 3.542834 1.551113
O  -1.849386 1.457919 -2.381834
O  -5.249174 -1.13014 3.188965
O  6.326776 -0.527362 -0.183097
N  -1.304995 -0.775964 0.677762
N  -2.22141 -1.625625 2.594992
N  -3.377564 0.291061 -0.257673
N  -5.350263 0.011097 1.122099
C  1.211137 1.239404 0.521174
C  -0.025991 1.084906 -0.38945
C  1.972241 -0.093375 0.391733
C  -0.312868 -0.442833 -0.370903
C  3.143943 -0.055031 -0.599557
C  3.792039 -1.440515 -0.750471
C  -2.652815 -0.426089 0.677432
C  -1.101108 -1.511813 1.873325
C  -3.217417 -0.947754 1.859482
C  0.237062 2.581352 2.342856
C  -0.654592 1.718215 -2.664475
C  -4.643436 -0.736713 2.159676
C  -0.16672 2.525707 3.792431
C  -0.152676 2.286204 -3.964032
C  -4.738118 0.460393 0.048488
C  6.117936 -0.929103 -1.35028
C  7.129066 -1.013213 -2.470616
H  1.797059 2.131836 0.245475
H  -0.878072 1.697407 -0.056322
H  2.29928 -0.438142 1.3893
H  -0.681943 -0.811208 -1.345375
H  2.79169 0.300586 -1.584577
H  3.900793 0.657943 -0.221921
H  3.073753 -2.1805 -1.132813
H  4.224773 -1.7806 0.208411
H  -0.129637 -1.926926 2.120533
H  -2.950812 0.714364 -1.099294
H  -0.559344 3.502575 4.107446
H  0.697085 2.24794 4.420633
H  -0.937492 1.748576 3.941404
H  0.868483 1.937358 -4.180326
H  -0.838416 2.015206 -4.780245
H  -0.123903 3.389089 -3.889245
H  -5.304811 1.023837 -0.703007
H  7.495118 -2.052619 -2.557317
H  7.984526 -0.357809 -2.250927
H  6.670244 -0.741703 -3.43459
