program: Gaussian 09
title: 000259676
version: EM64L-G09RevD.01
frameworkgroup: C1[X(C20H25NO3)]
method: RPBEPBE
basis: SDD
operation: Freq
keyword: #p
keyword: freq=noraman
keyword: PBEPBE/SDD
title: #p freq=noraman PBEPBE/SDD
converged: YES YES NO NO
title: Mulliken charges:
elementType: O O O N C C C C C C C C C C C C C C C C C C C C H H H H H H H H H H H H H H H H H H H H H H H H H
charge: -0.303077 -0.301099 -0.269067 -0.095300 -0.204506 0.357605 -0.478916 -0.562458 0.345924 -0.639784 -0.572280 -0.643199 -0.541349 0.518212 0.190774 0.191093 -0.336992 -0.478447 -0.366205 -0.350776 0.313393 -0.530497 -0.530630 -0.538828 0.226806 0.225786 0.223039 0.223553 0.232711 0.227178 0.232813 0.260888 0.220997 0.233412 0.205808 0.255890 0.270175 0.224738 0.244742 0.235404 0.227874 0.220334 0.252833 0.220548 0.254022 0.227733 0.218587 0.218130 0.242406
chargesum: 0.00000
title: Mulliken charges with hydrogens summed into heavy atoms:
elementType: O O O N C C C C C C C C C C C C C C C C C C C C
charge: -0.303077 -0.301099 -0.269067 -0.095300 0.022301 0.357605 -0.030091 -0.106194 0.345924 -0.179793 -0.311391 0.017019 -0.285459 0.518212 0.190774 0.191093 -0.066817 -0.253709 -0.121463 -0.115372 0.313393 0.170544 0.171672 0.140296
polarizability: 3.32434804e+02 1.35888299e+00 2.45750653e+02 1.31013273e+01 -6.31663811e+00 1.41558767e+02
1716.lowfreq: -5.1729 -0.0004 -0.0004 0.0008 2.4403 5.7524 20.1569 23.9778 32.9656
frequency: 19.8881 23.9521 32.8972 53.4409 63.2516 79.0048 96.5714 104.3807 114.5344 137.5255 152.5425 160.3141 169.9084 172.7174 189.8155 205.7589 224.8853 237.4797 246.7252 259.7666 282.4899 288.7278 316.6393 334.7567 349.2219 391.5557 398.6533 414.8471 422.0455 431.0746 460.6782 484.9821 491.0089 506.1331 511.8553 550.3477 587.2662 632.4301 633.5805 656.4383 702.9977 714.6504 717.8534 728.7743 739.6107 759.6899 790.1837 805.9015 828.7327 852.2051 862.2570 888.4794 902.1664 905.9868 930.6133 949.3440 955.7333 966.3845 968.2041 990.5479 1005.4682 1007.8203 1026.6942 1050.4351 1071.5871 1106.4700 1111.1960 1112.8453 1115.0052 1115.6885 1120.4880 1146.9557 1149.4360 1155.8374 1159.2763 1161.7829 1174.9009 1178.3694 1194.9908 1211.1546 1213.5405 1226.4860 1236.9662 1262.0133 1265.7171 1280.7677 1300.0175 1313.7803 1317.8602 1345.5428 1358.9996 1371.1869 1383.0344 1386.8925 1415.0579 1422.9934 1432.6494 1436.6044 1442.3807 1450.9878 1457.1174 1458.7152 1460.2095 1466.6722 1467.5756 1473.6047 1474.2658 1477.4516 1484.4478 1487.4444 1490.3792 1499.7024 1566.3801 1581.9016 1613.8613 1621.8154 2886.6994 2954.5273 2965.0794 2968.5401 2970.9357 2983.9057 2989.2316 2998.0449 3016.5817 3021.6429 3039.9227 3046.6336 3051.2064 3064.5172 3067.4383 3073.4886 3112.4986 3117.9388 3118.9459 3120.7877 3128.9008 3135.6503 3143.9714 3156.2516 3164.9936
redmass: 3.7459 4.6107 4.0549 3.8105 3.8020 3.0825 3.3135 2.9219 4.1823 3.5045 2.4963 1.3001 1.5015 1.9260 3.0350 1.9158 1.5541 1.7105 1.5508 3.7664 4.8592 3.2741 4.0483 3.5599 2.7035 4.5764 3.2390 3.0121 4.0957 3.7507 2.9910 2.9919 3.4769 4.1448 4.6457 2.6276 4.4386 5.7576 4.5659 4.5529 3.9795 5.9339 4.3054 3.8344 3.4290 2.6852 4.3594 1.4986 1.7648 2.3696 2.2080 1.6039 1.5724 3.1994 1.4208 3.4351 4.7351 2.3485 1.3894 7.6092 2.6208 2.7165 2.3605 2.5947 4.2136 1.3902 1.2437 1.2606 1.7719 1.3046 1.4379 1.4406 1.5166 1.3470 1.3187 1.4445 3.0805 1.2439 1.3775 2.1001 1.5722 4.6104 1.3997 1.3576 3.6160 1.9894 1.3041 1.4639 1.4966 1.3510 2.1868 2.7465 4.2477 2.7772 3.2134 1.1735 1.1676 1.1694 1.3236 1.1115 1.0536 1.0720 1.0898 1.0504 1.0626 1.0901 1.0834 1.0547 2.6304 1.0662 1.0938 2.4525 8.1147 7.0404 7.1714 6.4378 1.0531 1.0332 1.0625 1.0309 1.0314 1.0666 1.0623 1.0790 1.0773 1.0945 1.1037 1.0988 1.1039 1.1037 1.1032 1.1007 1.0891 1.1026 1.1028 1.0990 1.0908 1.0916 1.0880 1.0935 1.0967
irintensity: 0.9786 0.1318 0.2308 1.1653 0.8029 1.9726 5.7162 6.8992 2.2536 4.3784 0.8243 0.1035 0.8276 2.8309 3.4960 0.4546 2.7313 2.5723 1.0600 5.2732 7.1950 2.6619 4.4499 0.7687 2.6210 0.8967 3.3948 0.3824 2.4316 3.5817 4.8227 2.8604 2.5458 6.9054 28.4267 24.8375 3.0229 2.5875 27.5104 11.3336 4.9019 9.6150 6.3379 11.8330 3.1698 5.7844 23.3633 26.7557 14.9935 19.0700 0.8892 2.4885 19.8884 41.8147 1.5379 12.0567 76.5380 11.0897 5.6294 48.8444 8.2431 4.9335 18.0867 30.4323 71.9987 23.4333 9.6470 0.2824 17.1183 7.7870 0.7277 5.8410 4.2697 2.4422 4.4601 8.4032 35.1946 80.2072 19.3446 42.9571 6.7713 127.7787 3.1550 6.3878 147.4070 11.7315 4.0833 7.1985 8.5111 1.2092 10.0281 12.8226 2.4022 12.4701 5.1164 0.7881 14.6410 10.7360 8.0584 14.1022 15.8900 3.5780 12.8961 13.1612 3.4653 37.3022 46.1391 4.5931 132.6456 41.5721 23.8026 151.0296 0.9158 6.7615 1.3480 36.1213 106.7812 76.9459 34.2791 85.3193 72.5342 10.8235 39.8834 36.8772 46.1957 39.1086 53.0397 24.1137 35.6286 30.9853 24.8020 30.8797 24.6589 25.6914 28.4544 24.7805 9.7901 4.7635 2.0214 18.4827 8.9299
temp: 298.150 k
press: 1.00000 atm
elementType: 8 8 8 7 6 6 6 6 6 6 6 6 6 6 6 6 6 6 6 6 6 6 6 6 1 1 1 1 1 1 1 1 1 1 1 1 1 1 1 1 1 1 1 1 1 1 1 1 1
symmnumber: 1
zpe: 1067488.7 jmol-1
zpe.correction: 0.406585 hartree
zpe.thermalcorrener: 0.430509 hartree
zpe.thermalcorrenthalpy: 0.431453 hartree
zpe.thermalcorrgfe: 0.351962 hartree
zpe.sumelectzpe: -1055.695947 hartree
zpe.sumelectthermal: -1055.672023 hartree
zpe.sumelectthermalent: -1055.671079 hartree
zpe.sumelectthermalfe: -1055.750570 hartree
dipole: -1.1437 -0.9682 0.3984
dipole: 1.5506
quadrupole: -134.2122 -124.3884 -145.2947
quadrupole: -10.1659 -0.3988 2.1148
quadrupole: 0.4196 10.2434 -10.6629 -10.1659 -0.3988 2.1148
hfenergy: -1056.1025319 hartree
pointgroup: C01 [X(C20H25N1O3)]
dipole: 0.4515914 -0.3823164 -0.1485305 debye
polarizability: 331.9401863|-1.6427257|245.7817371|16.2775349|6.056094|142.0223004 unknown
InChI: InChI=1S/C20H25NO3/c1-21-10-9-15-12-19(23-3)20(24-4)13-17(15)18(21)11-14-5-7-16(22-2)8-6-14/h5-8,12-13,18H,9-11H2,1-4H3
charge 0 multiplicity 1
49 atoms
O  3.642234 -2.529681 -0.53549
O  5.524395 -0.464548 0.35345
O  -6.56614 -0.585591 -0.466532
N  -0.435387 2.177279 -0.337602
C  -0.122717 0.721587 -0.29661
C  1.382729 0.429069 -0.13353
C  0.291725 2.931703 0.712069
C  1.83182 2.860986 0.550518
C  2.297751 1.431596 0.295103
C  -0.960865 -0.002915 0.81505
C  1.866004 -0.87786 -0.390945
C  -0.322315 2.770293 -1.687505
C  3.668135 1.098473 0.436919
C  -2.433937 -0.174744 0.474492
C  3.224391 -1.208406 -0.234965
C  4.145592 -0.197333 0.166342
C  -3.294305 0.945108 0.294143
C  -2.992884 -1.466932 0.329181
C  -4.654442 0.775245 -0.020757
C  -4.359749 -1.65927 0.014806
C  -5.19346 -0.528616 -0.159304
C  4.172886 -3.278164 0.627409
C  6.246611 -0.85311 -0.880404
C  -7.167188 -1.911979 -0.605993
H  -0.450722 0.295069 -1.265008
H  0.007502 2.515514 1.697191
H  -0.050458 3.982959 0.691856
H  2.327912 3.270966 1.451441
H  2.144214 3.505154 -0.297104
H  -0.839868 0.563364 1.759359
H  -0.510522 -0.996914 0.992131
H  1.184571 -1.6715 -0.720403
H  -0.607069 3.837425 -1.639844
H  -1.028068 2.2613 -2.36801
H  0.696215 2.705049 -2.140012
H  4.394677 1.855763 0.753874
H  -2.867153 1.9493 0.381301
H  -2.352578 -2.347783 0.466978
H  -5.319775 1.63338 -0.159417
H  -4.752698 -2.675694 -0.086275
H  4.487958 -4.255105 0.229611
H  3.377681 -3.418676 1.384445
H  5.030628 -2.748756 1.080522
H  6.246974 -0.012586 -1.600524
H  5.785874 -1.743575 -1.344976
H  7.276829 -1.072332 -0.560355
H  -7.083047 -2.494916 0.332465
H  -6.703984 -2.481507 -1.435943
H  -8.227678 -1.72609 -0.832147
