program: Gaussian 09
title: 000259649
version: EM64L-G09RevD.01
frameworkgroup: C1[X(C8H8N2O5)]
method: RPBEPBE
basis: SDD
operation: Freq
keyword: #pfreq=noraman
keyword: PBEPBE/SDD
title: #p freq=noraman PBEPBE/SDD
converged: YES YES NO NO
title: Mulliken charges:
elementType: O O O O O N N C C C C C C C C H H H H H H H H
charge: -0.259743 -0.190454 -0.190452 -0.185714 -0.185695 0.019558 0.019570 0.517432 0.091354 0.334541 0.334498 -0.526958 -0.526769 -0.792203 -0.506494 0.288494 0.288490 0.235664 0.235658 0.251936 0.252754 0.252775 0.241757
chargesum: 0.00000
title: Mulliken charges with hydrogens summed into heavy atoms:
elementType: O O O O O N N C C C C C C C C
charge: -0.259743 -0.190454 -0.190452 -0.185714 -0.185695 0.019558 0.019570 0.517432 0.091354 0.334541 0.334498 -0.238464 -0.238279 -0.068945 0.240792
polarizability: 1.54467687e+02 -1.78280614e-03 1.63960536e+02 6.81376697e-04 -5.82663454e+00 6.34336457e+01
1716.lowfreq: -39.5163 -2.6916 -0.0007 -0.0004 0.0003 4.4725 5.2551 39.9450 54.9012
frequency: -39.4867 39.9225 54.9001 62.9229 100.3351 132.7653 159.3890 173.1062 203.1073 214.6085 223.0569 276.0951 311.9122 345.2772 348.7266 406.2747 446.8612 447.8402 490.3447 566.6869 638.3400 641.4181 678.7267 717.0735 720.0740 734.6060 776.9218 864.1527 899.9510 922.5342 943.5516 949.6457 1012.1552 1051.2630 1096.1131 1101.1703 1147.6170 1199.4779 1201.5127 1216.5170 1237.8494 1250.2293 1352.2324 1366.6671 1367.6601 1404.9313 1412.6359 1418.5826 1465.4910 1467.0290 1468.9828 1474.4590 1475.5235 1556.9192 1617.1625 2986.7486 3017.5522 3070.6515 3099.8268 3137.4718 3151.8226 3163.1442 3165.4681
redmass: 1.0176 14.0363 6.9739 7.7586 1.0777 4.8182 4.4523 12.5632 3.9364 3.4077 3.7498 6.2128 10.6078 7.6027 6.5272 5.2114 6.1423 6.0162 8.5067 3.0622 5.8937 6.5131 10.7852 7.0223 8.6655 11.4388 5.0355 10.5794 1.5033 8.3690 1.3995 7.2677 1.4084 1.5633 1.2069 2.6543 1.3284 2.9418 3.1487 3.3078 7.5253 4.0524 4.0776 9.3310 5.4722 1.2158 4.5685 1.4210 1.1180 1.0854 1.0912 1.2627 2.0454 6.0500 6.8921 1.0392 1.0271 1.0951 1.1004 1.1070 1.1051 1.0916 1.0931
irintensity: 1.0416 0.2264 4.9282 1.3998 0.7656 0.3929 2.2216 3.5642 4.7994 4.0234 7.2183 0.2402 0.7507 1.0515 4.9846 0.0672 0.2003 6.1774 5.2904 20.5121 4.5875 2.1264 36.7016 3.4321 0.4853 5.8243 23.0563 21.1340 20.0661 58.2060 2.2673 13.0462 2.3593 11.9842 1.3440 34.0085 7.4125 68.8771 1.0650 337.3862 94.2065 10.8477 1.3978 28.1506 165.7494 20.3857 0.6966 33.5462 10.7398 1.6601 16.0187 74.1989 160.6056 46.4686 1.8103 16.1338 52.7220 13.5398 10.2617 5.7691 11.7494 2.4492 0.4324
temp: 298.150 k
press: 1.00000 atm
elementType: 8 8 8 8 8 7 7 6 6 6 6 6 6 6 6 1 1 1 1 1 1 1 1
symmnumber: 1
zpe: 416575.6 jmol-1
zpe.correction: 0.158665 hartree
zpe.thermalcorrener: 0.172424 hartree
zpe.thermalcorrenthalpy: 0.173368 hartree
zpe.thermalcorrgfe: 0.117157 hartree
zpe.sumelectzpe: -793.970046 hartree
zpe.sumelectthermal: -793.956287 hartree
zpe.sumelectthermalent: -793.955343 hartree
zpe.sumelectthermalfe: -794.011554 hartree
dipole: -0.0005 3.8269 2.2627
dipole: 4.4458
quadrupole: -111.1756 -71.2233 -86.6897
quadrupole: -0.0065 0.0016 -0.1700
quadrupole: -21.4794 18.4729 3.0065 -0.0065 0.0016 -0.1700
hfenergy: -794.1287112 hartree
pointgroup: C01 [X(C8H8N2O5)]
dipole: 0.0002123 -1.5658718 0.7793855 debye
dipolederiv: -0.2909477 0.0001697 0.0000044 0.0000075 -1.4874693 -0.2112417 0.0000347 0.0398842 -0.3517874 -0.7954851 -0.1030847 -0.1997256 -0.0587136 -0.4339501 -0.1534997 -0.1557527 -0.1606096 -0.3420911 -0.7952468 0.1029186 0.2000481 0.0586069 -0.4338094 -0.1536512 0.1557964 -0.1606028 -0.3423294 -0.4894247 0.1645947 -0.0115691 0.1423603 -0.6520928 -0.2378019 -0.0949947 -0.2132359 -0.3307763 -0.4895022 -0.1647415 0.0115912 -0.1423861 -0.6519028 -0.237743 0.0950029 -0.2133286 -0.3309802 1.4730141 -0.2167891 0.2628066 -0.348348 0.8880857 0.4358127 0.2679595 0.3759704 0.4650059 1.4726541 0.2170786 -0.2632738 0.3484434 0.8877869 0.4358503 -0.2683679 0.3759858 0.4655409 -0.4478463 -0.0001279 0.0000925 -0.0001066 0.5360034 0.0030578 0.0000831 0.0818888 -0.0320216 0.4091409 -0.0001639 -0.0000373 0.0000034 1.0488698 -0.0286642 -0.0000546 -0.3629987 0.0234372 -0.4308211 -0.0248885 -0.0333302 0.2583845 -0.2486996 -0.0541065 -0.0091373 -0.0246857 0.0294179 -0.4305274 0.0249645 0.0334701 -0.258359 -0.2487703 -0.0540399 0.0093693 -0.0247747 0.0293369 0.1415968 0.1010302 0.0046675 -0.3149577 -0.0482506 -0.0165682 -0.0457472 0.0225887 -0.0912216 0.141595 -0.1009667 -0.0047916 0.3149243 -0.0481675 -0.0166875 0.0457022 0.022667 -0.0912361 0.0574826 0.0002174 -0.0000155 0.00008 -0.1756431 -0.0096818 0.0000143 -0.1198145 0.0505413 0.1968612 -0.0001265 0.0000029 0.0000147 0.7629222 0.214096 0.00005 0.3772231 0.3819439 0.0604001 -0.0551281 0.0036843 -0.0315986 0.0934939 0.0124977 0.0136046 -0.0174867 0.1548472 0.0603792 0.0551093 -0.0036355 0.0315999 0.0935123 0.0124808 -0.0135362 -0.0175171 0.1548452 -0.0430731 0.0827529 -0.095116 0.007255 0.0388203 0.0171298 -0.0676799 0.0696527 0.0689106 -0.0432465 -0.0828943 0.0950061 -0.0072474 0.0388733 0.0171022 0.0675778 0.0695613 0.0690685 0.1229408 0.0000135 0.0001286 0.0000191 -0.0095272 -0.0425443 0.0000901 -0.0802474 -0.0661541 0.0002403 -0.0593526 -0.1251122 0.0239132 0.071084 0.0136415 -0.0735048 -0.0607766 0.0220357 0.0003337 0.0594061 0.1251141 -0.0239027 0.0711637 0.0136675 0.0734974 -0.0607186 0.0220258 0.1194821 0.0000082 -0.0000097 0.0000074 -0.0923326 0.0408935 -0.0000072 0.0813749 0.0416408 unknown
polarizability: 154.4676832|0.0016139|162.6004989|-0.0172856|12.9930879|64.7936868 unknown
InChI: InChI=1S/C8H8N2O5/c1-5-3-6(9(11)12)8(15-2)7(4-5)10(13)14/h3-4H,1-2H3
charge 0 multiplicity 1
23 atoms
O  -0.000165 1.926864 -0.262234
O  -3.482446 -0.184374 -0.615314
O  3.481968 -0.184104 -0.616824
O  -2.680306 1.613569 0.532271
O  2.680343 1.61345 0.531741
N  -2.533003 0.460982 -0.023576
N  2.53273 0.461186 -0.024691
C  0.000017 -2.335732 0.128094
C  -0.000125 0.574483 0.015787
C  -1.20419 -0.195654 0.039058
C  1.204006 -0.195576 0.038509
C  -1.208106 -1.604796 0.090352
C  1.208078 -1.604703 0.089771
C  0.000101 -3.851032 0.165363
C  -0.000199 2.929672 0.844433
H  -2.174728 -2.118157 0.085116
H  2.174736 -2.117995 0.084057
H  0.893184 -4.243518 0.680432
H  -0.893439 -4.243643 0.679535
H  0.000656 -4.267733 -0.859894
H  0.916728 2.812143 1.441889
H  -0.917073 2.812047 1.441949
H  -0.000267 3.897824 0.324373
