program: Gaussian 09
title: 000259645
version: EM64L-G09RevD.01
frameworkgroup: C1[X(C10H10O)]
method: RPBEPBE
basis: SDD
operation: Freq
keyword: #pfreq=noraman
keyword: PBEPBE/SDD
title: #p freq=noraman PBEPBE/SDD
converged: NO YES NO NO
title: Mulliken charges:
elementType: O C C C C C C C C C C H H H H H H H H H H
charge: -0.259411 0.362912 -0.353821 -0.372536 -0.225043 -0.197114 -0.256914 -0.363844 0.003684 0.006366 -0.742489 0.244347 0.251846 0.222595 0.227015 0.227443 0.234594 0.234538 0.249421 0.252169 0.254242
chargesum: 0.00000
title: Mulliken charges with hydrogens summed into heavy atoms:
elementType: O C C C C C C C C C C
charge: -0.259411 0.362912 -0.109474 -0.120691 -0.002448 0.029901 -0.029472 0.105289 0.003684 0.006366 0.013344
polarizability: 1.80437604e+02 5.35048036e+00 9.91051321e+01 -2.76405086e-02 1.27564306e-02 5.24750984e+01
1716.lowfreq: -2.4936 -0.0007 -0.0005 -0.0003 10.7403 15.2138 18.3800 38.0934 64.6212
frequency: 17.9479 38.0231 64.5902 102.3010 182.1492 207.3277 234.1332 278.9726 363.7364 374.8966 411.6094 462.9627 502.9838 575.8031 610.1538 692.4183 756.9947 763.1051 815.5839 820.5968 887.4205 932.2374 959.2780 982.2662 982.8576 996.5740 1022.9954 1031.7244 1034.5648 1085.4894 1166.7402 1176.9450 1191.7806 1206.1013 1210.3292 1316.0846 1358.9495 1389.5725 1402.2200 1443.5531 1459.5130 1462.9616 1465.7287 1481.0654 1590.3015 1612.6737 2299.8272 2943.1540 2978.4222 2992.8977 3067.6179 3068.8909 3127.3092 3136.4744 3155.3101 3163.8687 3172.7520
redmass: 1.0268 4.8336 3.9272 3.5912 4.8088 2.6686 4.4592 4.5756 4.1908 5.2364 2.9322 5.7422 2.8658 7.7724 6.4372 2.0194 1.6750 4.6520 5.5377 1.2507 1.4480 9.1495 1.3629 1.3028 6.0563 1.5798 2.0852 1.4049 1.3847 1.5267 1.1112 1.4273 2.3284 1.0514 3.0705 1.3348 1.4855 5.4758 1.2231 2.3439 1.0409 1.0447 1.2158 1.8956 6.3253 6.2913 11.6762 1.0543 1.0351 1.1053 1.0983 1.0987 1.0848 1.0889 1.0925 1.0951 1.1005
irintensity: 0.0116 1.3719 1.6002 1.3911 3.5279 17.9690 2.7357 2.9991 0.0092 2.7777 0.1036 1.8714 12.5921 1.1368 1.1618 36.0855 91.1067 0.8177 22.2594 0.6375 8.2389 132.9783 0.1225 0.6242 2.4351 0.9024 18.0169 5.1214 4.7168 12.8119 15.5255 25.4101 43.4831 0.6786 252.7820 3.5766 51.8638 29.0927 2.8967 3.3354 14.1502 16.4366 35.9717 63.6576 31.2370 75.3338 34.2023 31.2730 31.3023 25.7949 12.9739 13.2433 3.7344 12.4625 35.0651 23.6175 5.1653
temp: 298.150 k
press: 1.00000 atm
elementType: 8 6 6 6 6 6 6 6 6 6 6 1 1 1 1 1 1 1 1 1 1
symmnumber: 1
zpe: 438029.1 jmol-1
zpe.correction: 0.166836 hartree
zpe.thermalcorrener: 0.177835 hartree
zpe.thermalcorrenthalpy: 0.178779 hartree
zpe.thermalcorrgfe: 0.127895 hartree
zpe.sumelectzpe: -461.418994 hartree
zpe.sumelectthermal: -461.407996 hartree
zpe.sumelectthermalent: -461.407051 hartree
zpe.sumelectthermalfe: -461.457936 hartree
dipole: 1.3405 -1.2928 -0.0124
dipole: 1.8624
quadrupole: -46.7191 -58.9291 -68.6604
quadrupole: 0.2917 -0.0594 -0.0081
quadrupole: 11.3838 -0.8262 -10.5576 0.2917 -0.0594 -0.0081
hfenergy: -461.5858303 hartree
pointgroup: C01 [X(C10H10O1)]
dipole: 0.5313682 0.5044345 -0.0077166 debye
dipolederiv: -2.0171202 -0.1038865 0.0140345 -0.1911725 -0.288806 0.0011635 0.0177461 0.000174 -0.2811318 1.7113991 0.0140833 -0.0133305 -0.3057751 0.0495205 0.0028949 -0.0091869 0.0008075 0.1126205 -0.3632502 -0.0277421 0.0014343 0.3610681 -0.0543988 -0.0056719 -0.0045696 -0.0024018 -0.2213668 -0.4450973 0.0058574 0.0016211 -0.2229187 0.0265524 -0.0014077 0.0058045 -0.0034211 -0.1888015 0.1513881 0.0700365 -0.0037036 -0.0629996 0.1551818 -0.0042697 -0.0015352 -0.0055465 -0.1424437 0.16736 -0.0279531 -0.0022137 0.0026251 0.161187 -0.0050893 -0.0027701 -0.0047114 -0.1450926 -0.0437494 -0.0451706 -0.0007472 0.0063093 -0.2212622 0.0003034 -0.0014763 0.0007293 -0.203102 1.3806651 0.0735931 -0.0051097 0.5966832 0.460707 -0.007587 -0.0165547 0.0015357 0.4261287 -0.5399621 0.0126514 -0.0025819 0.1399311 -0.2014186 0.0040205 0.0015763 -0.0003415 -0.140954 0.2129145 -0.085365 0.0051689 -0.1279994 -0.0819355 -0.0041865 0.0016575 -0.0004825 -0.1460308 0.004781 0.0166992 -0.0069436 0.0084397 0.0842353 0.0068206 -0.024781 0.0045258 0.10161 0.0169407 -0.1047086 0.0029629 -0.1284408 -0.0234549 0.004291 0.0034318 0.0040599 0.1730228 0.0711692 0.0754535 -0.0003097 0.068699 -0.026732 0.0026377 -0.0002394 0.002616 0.1731683 0.0312615 0.0753641 -0.000157 0.0988022 -0.0921356 0.0031696 -0.0005149 0.0033784 0.1559851 -0.0017858 -0.1019277 0.0029801 -0.1111036 -0.059255 0.0044472 0.0031876 0.0043505 0.1564185 -0.1411278 0.0197942 0.0024352 0.018442 0.0839332 0.0012992 0.0024564 0.0012923 0.1744671 -0.0781331 0.0588655 -0.0559422 -0.1047384 -0.023608 0.079268 -0.036996 0.106272 -0.0494058 -0.077306 0.0557604 0.0561527 -0.1049593 -0.0303167 -0.078172 0.0406166 -0.1080317 -0.0453071 -0.0623989 -0.0644822 -0.0231422 -0.0997697 -0.0155235 -0.0411132 -0.0286229 -0.0386684 0.1232383 0.0027769 0.0440217 0.0389053 0.072207 0.0897809 -0.0701011 0.0854766 -0.0799695 -0.0564 0.0192747 0.0390557 -0.0115137 0.0866705 0.0077485 0.107283 -0.0347063 0.1138329 0.0233769 unknown
polarizability: 180.3407633|-6.0005471|99.1833456|-0.9349288|-0.6963247|52.4937256 unknown
InChI: InChI=1S/C10H10O/c1-2-3-9-11-10-7-5-4-6-8-10/h4-8H,9H2,1H3
charge 0 multiplicity 1
21 atoms
O  0.46631 -0.441939 -0.086794
C  -0.919076 -0.193478 -0.078752
C  -1.513024 1.094542 -0.094297
C  -1.732857 -1.35461 -0.052951
C  -2.923991 1.20502 -0.083682
C  -3.134453 -1.226184 -0.042678
C  -3.741256 0.054984 -0.057966
C  1.352773 0.749608 -0.113055
C  2.745456 0.304389 -0.117151
C  3.930515 -0.035874 -0.12163
C  5.340383 -0.451602 -0.125146
H  -0.907042 2.005174 -0.114256
H  -1.245388 -2.334489 -0.041383
H  -3.380104 2.201571 -0.095831
H  -3.756655 -2.12799 -0.02268
H  -4.832021 0.15061 -0.049932
H  1.131254 1.348764 -1.021427
H  1.145768 1.377447 0.779212
H  6.004979 0.40003 0.110191
H  5.638122 -0.851764 -1.111446
H  5.521606 -1.238407 0.629757
