program: Gaussian 09
title: 000259694
version: EM64L-G09RevD.01
frameworkgroup: C1[X(C20H32O3)]
method: RPBEPBE
basis: SDD
operation: Freq
keyword: #pfreq=noraman
keyword: PBEPBE/SDD
title: #p freq=noraman PBEPBE/SDD
converged: YES YES NO NO
title: Mulliken charges:
elementType: O O O C C C C C C C C C C C C C C C C C C C C H H H H H H H H H H H H H H H H H H H H H H H H H H H H H H H H
charge: -0.440353 -0.457480 -0.277091 -0.125739 0.446739 -0.167185 -0.084019 0.268586 -0.533976 -0.542897 -0.270886 -0.579214 -0.156480 -0.501530 0.488401 -0.515077 -0.869458 -0.485212 -0.837134 -0.687713 -0.473812 0.039563 -0.514095 0.200386 0.248308 0.189716 0.191429 0.222566 0.230306 0.212089 0.244885 0.248007 0.223835 0.212450 0.219512 0.209590 0.203610 0.215294 0.235739 0.228491 0.249896 0.211576 0.222900 0.228657 0.225394 0.233534 0.226200 0.216808 0.207440 0.186664 0.344531 0.353439 0.232921 0.195551 0.204337
chargesum: 0.00000
title: Mulliken charges with hydrogens summed into heavy atoms:
elementType: O O O C C C C C C C C C C C C C C C C C C C C
charge: -0.095821 -0.104041 -0.277091 0.074647 0.446739 0.081123 0.105698 0.268586 -0.119981 -0.100503 -0.026001 -0.107373 0.055970 -0.072427 0.488401 -0.096173 -0.155332 -0.273636 -0.160183 -0.227979 -0.049564 0.226227 0.118713
polarizability: 2.79211477e+02 -8.74839497e+00 2.00732144e+02 1.96677100e-01 -3.04334652e+00 1.68339402e+02
1716.lowfreq: -0.0008 0.0005 0.0008 0.4650 7.2852 9.5890 33.0504 48.5095 61.3285
frequency: 32.7189 48.4993 61.2997 79.1052 92.8018 106.6344 120.2899 127.7325 169.2813 171.6552 195.2049 198.9897 201.9706 217.5648 231.3678 253.8521 258.8891 267.7682 282.1281 290.7107 297.7870 307.5438 310.6512 362.8006 370.3024 394.1098 398.4957 399.8763 432.6139 452.9897 461.8848 471.4697 495.8740 520.9290 527.5180 563.7697 567.6167 589.8753 601.0433 614.5779 664.4240 697.2818 726.2416 755.4656 792.2846 800.4646 815.2134 825.8250 835.5254 843.5416 878.8967 895.7366 908.5606 918.6294 937.1876 950.0148 959.8655 976.9245 989.5199 992.6663 1001.0704 1014.8644 1018.8448 1024.6321 1027.3425 1031.5696 1050.2575 1061.6841 1077.1895 1078.9223 1098.6521 1111.9812 1116.5028 1120.9042 1127.2143 1134.4393 1139.5511 1143.2035 1155.7998 1160.6166 1172.3247 1178.1585 1195.2044 1204.4142 1209.4873 1220.5039 1236.5104 1240.5990 1250.2446 1252.3271 1257.2522 1274.2735 1284.9339 1286.5930 1291.3442 1296.9163 1301.9569 1314.5142 1326.6516 1331.4266 1333.3284 1340.8682 1343.8711 1346.5129 1347.5038 1353.0001 1365.7963 1368.7793 1371.2078 1382.2425 1389.1465 1395.2578 1433.9556 1456.9255 1457.9186 1458.9112 1461.1986 1463.1768 1467.5033 1469.1169 1472.8730 1477.7241 1482.8595 1489.8864 1491.5544 1499.8328 1684.6036 2900.4064 2906.3920 2917.1267 2925.1202 2926.5713 2954.6138 2960.3260 2972.4832 2975.4468 2980.4949 2986.6908 2987.6047 2991.6169 2996.0374 2996.9875 3002.8930 3010.1589 3021.6952 3023.9754 3029.5681 3044.4562 3045.9864 3051.8707 3070.9628 3071.6767 3077.5010 3079.8530 3083.0002 3088.7595 3095.1124 3477.0816 3574.3213
redmass: 4.4656 3.4351 3.2674 3.7202 2.5563 4.0810 1.5562 1.9399 2.0562 1.7949 3.0550 1.5878 2.1616 1.5389 2.0442 1.6461 2.7269 2.3851 2.7391 4.0550 2.8411 2.7359 2.6799 2.4277 2.7795 3.2890 3.0556 3.0234 3.3249 3.1974 2.6531 3.0336 2.8737 3.2854 2.8222 1.7691 3.7324 1.6630 2.4124 3.5045 2.6755 3.3175 3.0016 3.8612 1.9606 1.9956 2.0636 1.8811 2.2203 2.2654 1.7953 1.7217 2.5650 2.1332 1.7403 2.1410 1.9388 2.2265 2.1568 2.2871 2.2100 2.1245 2.3499 2.0282 2.5080 2.0245 4.9068 2.3755 2.5625 2.6091 1.6381 1.3661 1.5943 2.0630 1.6016 2.2153 2.2192 1.3873 1.7237 1.7692 1.6822 1.7975 2.3887 1.3833 1.8060 1.5390 1.4864 1.3552 1.4822 1.4406 1.3429 1.6171 1.3933 1.3812 1.3870 1.3204 1.5119 1.3530 1.4581 1.5033 1.3467 1.4650 1.4649 1.5097 1.5076 1.4254 1.4501 1.3746 1.3152 1.3175 1.2378 1.2056 1.1326 1.0793 1.0867 1.0698 1.0748 1.0806 1.0872 1.0819 1.0784 1.0531 1.0707 1.0588 1.0610 1.0573 7.8432 1.0802 1.0826 1.0810 1.0655 1.0362 1.0627 1.0625 1.0822 1.0621 1.0395 1.0616 1.0414 1.0575 1.0853 1.0897 1.0998 1.0635 1.0884 1.0960 1.0961 1.1017 1.1008 1.0976 1.0993 1.1018 1.0991 1.0973 1.0903 1.0978 1.0973 1.0642 1.0665
irintensity: 0.0258 1.5728 0.8144 24.4403 3.3226 6.2034 100.6234 88.5690 0.1888 2.4573 3.0386 2.7521 8.3180 6.1399 0.4924 5.3124 0.6373 2.2611 0.6978 17.2687 2.9905 0.5785 0.7087 0.1395 2.8281 3.6841 1.9083 2.1791 2.7944 4.1107 0.7034 5.4006 2.2977 1.8511 0.3397 9.4320 2.9248 30.0955 7.6964 8.2824 8.4839 1.7090 4.4500 24.7966 3.7293 5.0911 13.2252 13.0499 1.3036 10.1242 2.7557 10.7541 8.4079 10.0180 2.7610 18.5547 1.1413 4.4562 11.4803 46.9012 24.9031 7.1144 5.3861 5.5656 103.5737 12.0528 140.8455 5.8608 16.3786 1.2505 1.7867 0.8871 1.4879 10.6615 1.9877 9.1639 4.5279 7.5674 17.5744 0.8658 0.7400 4.1404 2.9217 11.3649 3.3876 15.3780 3.0117 20.1755 1.9243 13.8064 1.3867 3.4006 6.2370 4.3887 2.5868 1.1173 1.6661 0.2989 1.1103 2.8829 0.9671 1.1948 3.7734 6.0958 13.8483 0.5929 10.3644 17.1757 26.4544 11.5071 12.2050 36.4193 4.0584 10.6035 5.3143 9.4627 4.8669 0.9712 17.9492 4.8376 6.5343 5.6239 28.0227 0.9860 5.8427 10.0072 2.6674 15.2401 33.2921 15.7732 47.6389 86.6503 41.5177 29.7865 14.1118 23.1202 26.4390 36.2825 7.7196 31.4895 20.5104 35.0835 74.7674 32.2857 36.5442 19.5637 72.7196 54.6377 42.0733 37.5719 19.0859 59.1722 13.0050 39.3025 52.6301 26.1608 38.1222 20.1705 8.8342
temp: 298.150 k
press: 1.00000 atm
elementType: 8 8 8 6 6 6 6 6 6 6 6 6 6 6 6 6 6 6 6 6 6 6 6 1 1 1 1 1 1 1 1 1 1 1 1 1 1 1 1 1 1 1 1 1 1 1 1 1 1 1 1 1 1 1 1
symmnumber: 1
zpe: 1270240.8 jmol-1
zpe.correction: 0.483809 hartree
zpe.thermalcorrener: 0.506753 hartree
zpe.thermalcorrenthalpy: 0.507698 hartree
zpe.thermalcorrgfe: 0.433752 hartree
zpe.sumelectzpe: -1005.148399 hartree
zpe.sumelectthermal: -1005.125454 hartree
zpe.sumelectthermalent: -1005.124510 hartree
zpe.sumelectthermalfe: -1005.198456 hartree
dipole: -0.0569 0.4839 -1.9607
dipole: 2.0203
quadrupole: -140.5629 -143.3574 -140.0267
quadrupole: -16.7807 -5.8746 -4.7839
quadrupole: 0.7527 -2.0417 1.2890 -16.7807 -5.8746 -4.7839
hfenergy: -1005.6322077 hartree
pointgroup: C01 [X(C20H32O3)]
dipole: -0.0295978 -0.1544821 0.779142 debye
polarizability: 278.8164217|10.3910729|200.7659008|0.9531157|-4.4176299|168.7007001 unknown
InChI: InChI=1S/C20H32O3/c1-19-8-6-13(23-3)10-12(19)4-5-14-15(19)7-9-20(2)16(14)11-17(21)18(20)22/h4,13-18,21-22H,5-11H2,1-3H3
charge 0 multiplicity 1
55 atoms
O  -5.349799 1.289897 0.215621
O  -5.512614 -1.292405 -0.56101
O  5.921144 -0.291404 -0.067411
C  -2.137285 -0.613173 0.411425
C  -2.865181 0.701483 -0.00345
C  -0.718434 -0.757164 -0.171744
C  0.141821 0.477441 0.253331
C  1.594807 0.431631 -0.358191
C  -2.033689 1.886363 0.536606
C  -0.581323 1.832182 -0.009182
C  -4.239542 0.476488 0.699949
C  -3.183138 -1.724983 0.147341
C  -4.534483 -1.071581 0.534051
C  -0.047453 -2.061238 0.320887
C  2.197723 -0.9800 -0.209857
C  2.501459 1.431196 0.441233
C  -3.089444 0.834989 -1.532697
C  1.450469 -2.071058 0.110543
C  1.59135 0.820318 -1.870517
C  3.69669 -1.115939 -0.45388
C  4.007388 1.332502 0.104212
C  4.521727 -0.098807 0.356058
C  6.894041 0.383554 0.78869
H  -2.005764 -0.548474 1.518711
H  -0.779266 -0.796704 -1.278942
H  0.267829 0.385187 1.357888
H  -2.013573 1.839376 1.646489
H  -2.501415 2.852245 0.263254
H  -0.606278 2.039985 -1.094914
H  0.00059 2.654622 0.448837
H  -4.151673 0.728979 1.773265
H  -3.220417 -1.991647 -0.924906
H  -2.989888 -2.651983 0.713783
H  -4.943871 -1.485102 1.476151
H  -0.498396 -2.935485 -0.191079
H  -0.270076 -2.203169 1.402908
H  2.365603 1.234149 1.525514
H  2.157989 2.467145 0.258991
H  -3.604585 1.789292 -1.745799
H  -2.138841 0.838324 -2.091333
H  -3.712343 0.01779 -1.937791
H  1.957336 -3.041439 0.223188
H  1.402744 1.900217 -2.011002
H  2.559121 0.591827 -2.349034
H  0.815349 0.258139 -2.420593
H  4.035112 -2.139177 -0.211645
H  3.94254 -0.945908 -1.522292
H  4.192123 1.591189 -0.95639
H  4.566526 2.064139 0.71903
H  4.437243 -0.329357 1.445242
H  -5.656034 0.854505 -0.626351
H  -6.424248 -1.329035 -0.17668
H  7.885633 0.043048 0.44939
H  6.756136 0.105068 1.856161
H  6.841854 1.488364 0.69924
