program: Gaussian 09
title: 000259658
version: EM64L-G09RevD.01
frameworkgroup: C1[X(C16H21NO3)]
method: RPBEPBE
basis: SDD
operation: Freq
keyword: #p
keyword: freq=noraman
keyword: PBEPBE/SDD
title: #p freq=noraman PBEPBE/SDD
converged: YES YES NO NO
title: Mulliken charges:
elementType: O O O N C C C C C C C C C C C C C C C C H H H H H H H H H H H H H H H H H H H H H
charge: -0.254782 -0.288044 -0.263583 -0.242129 -0.401636 -0.364813 0.498898 -0.437693 0.188013 -0.318486 -0.385948 0.240534 -0.344953 -0.360893 -0.036086 -0.800093 0.182588 -0.587233 -0.257539 -0.665238 0.233093 0.222949 0.203766 0.238102 0.207949 0.196337 0.274103 0.232657 0.270912 0.269059 0.217175 0.270745 0.240614 0.234497 0.218617 0.219571 0.220701 0.233767 0.227928 0.250851 0.215722
chargesum: 0.00000
title: Mulliken charges with hydrogens summed into heavy atoms:
elementType: O O O N C C C C C C C C C C C C C C C C
charge: -0.254782 -0.288044 -0.263583 -0.242129 0.054406 0.077055 0.498898 -0.033407 0.188013 -0.044383 -0.153291 0.240534 -0.074041 -0.091834 0.181090 -0.054237 0.182588 -0.149045 0.196929 0.029263
polarizability: 2.70198115e+02 2.71037382e+01 1.85268360e+02 -6.20732777e+00 1.64648893e+01 1.52326663e+02
1716.lowfreq: -9.0158 -5.5527 -0.0009 -0.0007 -0.0004 2.6509 16.3412 18.3945 40.1993
frequency: 14.8586 18.2482 40.1948 44.4529 56.0401 66.2412 73.0315 79.8500 86.9441 99.9330 112.6530 135.6595 168.6852 187.1290 200.7665 225.7537 230.0618 277.8614 312.9760 330.0757 349.1169 377.5570 397.0713 409.6269 413.0034 441.5390 455.1107 484.9579 508.7316 566.6845 584.8127 627.6254 631.3382 647.4969 678.8042 709.4574 746.0570 753.8133 764.0990 815.9044 826.2257 837.3889 843.4694 854.5219 887.7045 926.2672 946.8772 977.4072 984.4623 988.9256 998.9562 999.9780 1011.4442 1013.7510 1027.9828 1042.2652 1051.0133 1063.9035 1095.3272 1103.7804 1126.2943 1148.5912 1154.7008 1187.7681 1194.1334 1234.6332 1247.1885 1253.7448 1266.2086 1279.8071 1281.4283 1292.2501 1308.0186 1323.9727 1350.5557 1356.8470 1362.2179 1377.8368 1381.9426 1389.8351 1418.7904 1426.6211 1448.4907 1454.2641 1462.0741 1462.1267 1471.8123 1479.8119 1484.6286 1498.7982 1500.7167 1570.2703 1594.0131 1616.5683 1621.0605 1659.5080 2951.4663 2986.0619 2990.2748 2992.3278 3018.6983 3028.0990 3031.6536 3050.4619 3075.3908 3078.3037 3087.7250 3090.0800 3092.2490 3093.2031 3118.0695 3129.6901 3141.9832 3164.3828 3172.0183 3196.8726 3199.2521
redmass: 4.0682 4.7628 3.3092 2.6985 2.9092 4.1672 3.6268 3.4127 4.8263 3.7227 2.9135 2.5667 3.2204 1.4143 1.6237 2.2686 2.2970 4.7732 2.9224 3.6810 4.2175 3.2649 2.8500 2.9773 2.9871 3.1122 3.0559 4.9019 3.4083 3.9109 3.2998 2.7075 6.1196 2.1485 3.9599 4.0630 1.1425 3.1863 3.9121 1.4512 1.7256 1.3684 2.7441 1.6756 2.5796 1.8525 1.3259 1.3580 1.3706 1.5781 2.5895 1.2825 2.6223 1.9675 1.6943 3.3218 2.5320 4.2971 2.1559 3.3217 1.5280 1.8629 1.6832 1.1812 1.6289 3.2744 1.3795 3.0009 1.4992 1.1169 1.1892 1.2160 1.2827 1.3693 1.9218 1.3003 1.4855 1.3301 4.4172 1.2342 3.8329 1.1792 1.0768 1.1031 1.0911 1.0433 1.0743 1.0687 1.0540 1.9336 1.2754 7.5168 7.4527 9.6373 6.6506 4.7443 1.0624 1.0620 1.0385 1.0361 1.0943 1.0592 1.0607 1.1006 1.0786 1.0978 1.0973 1.1017 1.1036 1.0765 1.1057 1.0984 1.0878 1.0962 1.0900 1.1145 1.0958
irintensity: 0.9067 0.2180 1.2419 1.5730 0.2755 1.8117 0.9711 3.1676 0.3752 1.8131 0.6757 0.5945 5.1568 1.1809 0.7629 0.4121 0.7051 0.8896 14.4340 1.2909 11.9951 6.6307 2.2627 0.6865 3.0175 10.1964 1.9070 5.6098 4.5114 6.2987 1.4944 11.6645 4.2711 11.4667 32.4198 7.0741 9.1280 8.1052 8.3135 1.0458 18.4839 3.3335 1.5737 33.6600 4.3769 1.8758 81.2064 3.9039 0.5090 60.2939 10.6835 6.2463 53.0794 15.2278 9.6099 4.8922 26.5419 310.7347 21.8372 10.8549 21.5979 90.4936 38.1710 94.5668 31.8745 43.8299 45.8288 368.8495 53.4310 2.2453 13.0745 17.3578 0.9087 3.1678 125.4864 9.3712 59.9862 40.3341 84.1230 24.0098 23.1898 5.1109 35.3935 28.9328 5.0628 16.9342 3.5081 21.8174 18.7633 51.7442 19.2468 43.4993 152.3495 218.0117 149.5320 18.2814 30.5937 15.0660 11.0090 23.7667 7.5146 38.9353 36.6516 13.1122 28.6249 14.0772 42.9305 41.1070 0.4425 7.3393 31.2117 9.1597 8.7271 8.8576 0.3977 28.3112 1.7680
temp: 298.150 k
press: 1.00000 atm
elementType: 8 8 8 7 6 6 6 6 6 6 6 6 6 6 6 6 6 6 6 6 1 1 1 1 1 1 1 1 1 1 1 1 1 1 1 1 1 1 1 1 1
symmnumber: 1
zpe: 885126.9 jmol-1
zpe.correction: 0.337127 hartree
zpe.thermalcorrener: 0.358696 hartree
zpe.thermalcorrenthalpy: 0.359640 hartree
zpe.thermalcorrgfe: 0.282828 hartree
zpe.sumelectzpe: -901.214171 hartree
zpe.sumelectthermal: -901.192602 hartree
zpe.sumelectthermalent: -901.191657 hartree
zpe.sumelectthermalfe: -901.268470 hartree
dipole: -3.2732 1.5259 -0.2012
dipole: 3.6170
quadrupole: -96.1840 -133.1426 -116.4924
quadrupole: 2.1215 -11.2671 -4.3339
quadrupole: 19.0890 -17.8696 -1.2194 2.1215 -11.2671 -4.3339
hfenergy: -901.5512977 hartree
pointgroup: C01 [X(C16H21N1O3)]
dipole: -1.2880213 0.5973599 -0.0957719 debye
polarizability: 270.1544259|27.1306858|183.9725904|-1.1161579|18.788647|153.6661223 unknown
InChI: InChI=1S/C16H21NO3/c1-4-6-7-12-17(13(3)18)15-10-8-14(9-11-15)16(19)20-5-2/h4,8-11H,1,5-7,12H2,2-3H3
charge 0 multiplicity 1
41 atoms
O  -1.189008 -3.383758 -0.845709
O  4.329524 0.484283 -0.745888
O  4.057303 1.310411 1.42248
N  -1.795741 -1.371688 0.197024
C  -2.873236 -0.471017 0.691011
C  -3.331544 0.554051 -0.373385
C  -0.438393 -0.876254 0.235743
C  -4.416823 1.513288 0.184087
C  -2.090826 -2.625442 -0.382845
C  0.426642 -1.022337 -0.881828
C  0.042941 -0.220121 1.40078
C  2.212768 0.150682 0.3249
C  1.737248 -0.514473 -0.834564
C  1.351992 0.290261 1.442913
C  -4.931071 2.47384 -0.868361
C  -3.557445 -3.061431 -0.400616
C  3.590795 0.705425 0.422576
C  -4.872719 3.826809 -0.790051
C  5.740878 0.973169 -0.738652
C  6.67415 -0.075132 -0.125485
H  -3.730366 -1.076705 1.028471
H  -2.508624 0.073296 1.579068
H  -3.726049 0.01857 -1.259926
H  -2.460347 1.141963 -0.717902
H  -4.009067 2.081859 1.042609
H  -5.262546 0.90575 0.572998
H  0.073721 -1.543436 -1.773062
H  -0.592846 -0.132323 2.287498
H  2.401494 -0.623383 -1.695907
H  1.732449 0.79041 2.339404
H  -5.376925 2.008892 -1.762343
H  -3.608088 -3.9921 -0.984437
H  -3.929665 -3.271828 0.619239
H  -4.223583 -2.311662 -0.862466
H  -5.259321 4.466264 -1.591507
H  -4.433898 4.334049 0.078405
H  5.959558 1.14978 -1.804137
H  5.78133 1.922695 -0.176518
H  6.580614 -1.041208 -0.650897
H  6.444994 -0.225069 0.942753
H  7.723328 0.264715 -0.209375
