program: Gaussian 09
title: 000259622
version: EM64L-G09RevD.01
frameworkgroup: C1[X(C6H12N2O3)]
method: RPBEPBE
basis: SDD
operation: Freq
keyword: #p
keyword: freq=noraman
keyword: PBEPBE/SDD
title: #p freq=noraman PBEPBE/SDD
converged: YES YES NO NO
title: Mulliken charges:
elementType: O O O N N C C C C C C H H H H H H H H H H H H
charge: -0.429458 -0.248733 -0.249400 -0.091172 -0.305446 -0.362167 -0.386734 -0.368371 -0.293098 -0.071243 -0.038527 0.279122 0.195666 0.240448 0.208746 0.218300 0.287085 0.229603 0.189596 0.179621 0.296303 0.350269 0.169593
chargesum: 0.00000
title: Mulliken charges with hydrogens summed into heavy atoms:
elementType: O O O N N C C C C C C
charge: -0.079189 -0.248733 -0.249400 -0.091172 -0.009144 0.112621 0.062460 0.137014 0.126101 0.108377 0.131065
polarizability: 1.06354090e+02 6.14856531e+00 9.58705023e+01 -7.31780880e+00 1.02887444e-01 6.47469347e+01
1716.lowfreq: -16.7260 -7.7029 -0.0010 -0.0010 -0.0007 5.5961 18.2325 36.4613 48.7233
frequency: 18.0322 36.2395 48.6434 53.1717 78.6648 129.7401 190.7185 213.2966 275.8319 285.7518 295.0877 353.8253 392.6935 409.6084 446.1288 516.2447 573.9791 617.6486 711.3580 785.5805 845.1084 859.4230 930.4202 957.0471 958.7265 973.0112 1017.2010 1038.2270 1046.5806 1072.9425 1154.2772 1169.9413 1192.8826 1203.9925 1253.1457 1298.8011 1317.4474 1322.3008 1347.6020 1366.9559 1368.7209 1374.6436 1382.8686 1397.2912 1443.9766 1452.9949 1463.6323 1470.8300 1479.3697 1622.0603 1648.3898 2932.6293 2938.3438 2957.6326 2984.6671 2989.5803 2992.0823 3060.0583 3073.6729 3081.3436 3093.0621 3534.9932 3550.1754
redmass: 7.0123 5.9758 4.4766 3.4879 5.2342 3.3192 2.6490 3.3873 2.8760 2.6616 2.9402 1.1852 2.3478 2.7154 4.1521 3.0811 1.1456 3.3090 2.2230 1.9046 2.7327 2.6040 1.9255 1.6604 1.9208 2.5301 3.3412 3.9766 2.0982 2.1577 1.4093 1.4993 2.5310 1.6078 1.5300 1.2146 1.2592 1.2074 1.3219 1.2530 1.2101 1.2980 1.2877 1.9749 1.0905 1.0990 1.0858 1.1872 1.5170 6.3297 5.8625 1.0868 1.0864 1.0690 1.0642 1.0653 1.0636 1.1000 1.0947 1.0954 1.1002 1.0779 1.0660
irintensity: 9.1449 1.7119 0.8156 6.8777 1.4313 14.2495 3.4232 14.2544 19.6336 5.2588 2.5690 185.0193 28.0179 19.6047 4.7296 24.9125 104.2543 8.1259 1.6142 8.4958 13.5994 3.2375 24.5686 3.4833 2.1834 2.0615 69.3722 18.8121 11.5489 33.4521 49.1941 32.9975 101.8525 11.7409 1.0419 22.5870 10.8048 9.6994 2.8373 8.7147 16.3564 6.0516 18.7249 59.2457 21.1335 5.2805 1.0527 62.5076 97.7079 208.4978 363.2657 132.5757 60.7404 59.8385 13.6923 73.7853 36.9853 23.9871 3.5108 34.8163 2.9769 10.5602 4.2139
temp: 298.150 k
press: 1.00000 atm
elementType: 8 8 8 7 7 6 6 6 6 6 6 1 1 1 1 1 1 1 1 1 1 1 1
symmnumber: 1
zpe: 490775.7 jmol-1
zpe.correction: 0.186927 hartree
zpe.thermalcorrener: 0.199681 hartree
zpe.thermalcorrenthalpy: 0.200626 hartree
zpe.thermalcorrgfe: 0.144913 hartree
zpe.sumelectzpe: -570.115928 hartree
zpe.sumelectthermal: -570.103173 hartree
zpe.sumelectthermalent: -570.102229 hartree
zpe.sumelectthermalfe: -570.157941 hartree
dipole: -1.6650 -6.9766 0.3614
dipole: 7.1816
quadrupole: -87.4978 -70.5207 -62.6391
quadrupole: -12.4429 -7.8637 2.2426
quadrupole: -13.9452 3.0318 10.9134 -12.4429 -7.8637 2.2426
hfenergy: -570.3028544 hartree
pointgroup: C01 [X(C6H12N2O3)]
dipole: -0.6930386 2.7325869 0.189495 debye
dipolederiv: -0.4555228 -0.1449483 0.2207085 -0.236749 -0.4914869 -0.0097248 0.2948074 -0.059346 -0.6153899 -0.5074744 0.426842 -0.0807636 0.0713892 -1.0929432 0.0187842 -0.1029348 0.261294 -0.3844239 -0.7148278 0.1148359 0.0067729 0.5215873 -0.7456919 -0.1632792 0.2377277 -0.2225671 -0.4588607 -0.6760225 -0.1009908 0.0108958 0.022463 -1.1270265 -0.0219609 0.0329082 -0.1699631 -0.392065 -1.2601411 0.1636235 0.0516184 0.1472854 -0.3883167 0.0934797 0.0273352 0.1584393 -0.4119464 0.4534313 0.1255083 -0.0087047 0.1008985 0.1331611 0.0765767 0.0214806 0.2009467 0.2116876 0.3301376 -0.2376849 0.0341648 -0.2063732 0.2953511 -0.0951512 0.0611587 -0.1531284 0.1592592 0.4212954 0.0835993 0.0814831 0.2507094 0.1585173 -0.0759811 0.206688 -0.1410888 0.2232389 0.3817348 0.156536 -0.0792087 0.2095079 0.3974245 -0.0369729 -0.1241546 -0.0259932 0.3867808 0.4764797 -0.2144151 0.2597344 -0.0489478 1.8093352 0.0110282 0.221952 -0.0394263 0.2462726 1.463144 -0.4006219 0.0375006 -0.7707866 0.867091 0.3418674 -0.0894274 0.3472247 0.3660617 0.0327268 -0.0015579 -0.0233923 0.0564768 0.0597808 0.0989084 -0.0063103 0.0298954 0.0363803 0.0158353 -0.0021893 0.0529891 0.0029132 -0.0839341 -0.1426973 0.0365852 -0.1002396 -0.0009272 -0.0114324 0.0135107 -0.0829488 -0.0398626 0.0342703 -0.1207484 -0.0713171 -0.0372312 -0.0031525 -0.0140987 -0.0768814 0.108606 -0.0324319 -0.0991163 0.0866241 0.065755 0.0947754 0.035798 -0.0523718 0.0461567 -0.0887822 0.0167966 -0.0130014 0.1297135 -0.0997624 0.0944257 -0.0357971 0.1064434 0.030987 0.0421623 -0.0235732 0.0297559 -0.0612667 -0.0106277 -0.0234911 0.0697759 -0.0306589 0.1203892 -0.0393368 0.0609885 -0.0525848 0.0688554 -0.0267771 0.0748113 0.0480179 -0.0596719 -0.1461437 -0.0824378 -0.1075476 -0.0180561 -0.0447841 -0.0714082 -0.0873414 -0.089345 -0.145843 -0.0334568 -0.1604985 0.0137719 0.0655679 0.0222508 -0.1856277 -0.0256654 0.0138448 0.1300297 0.0488366 -0.0377075 0.0374181 0.1553969 -0.1113616 -0.0936917 -0.1252847 0.2470553 0.1944617 0.1044716 -0.1266386 0.0913849 0.168897 0.0930736 -0.163575 0.0963548 0.3480302 -0.0776544 -0.0764068 -0.0962165 -0.1373187 -0.0623913 -0.1572341 -0.160784 -0.1474011 -0.0002956 unknown
polarizability: 107.0653983|-6.5684411|95.2474609|4.7394347|3.8863755|64.6586682 unknown
InChI: InChI=1S/C6H12N2O3/c9-4-3-8(6-11)2-1-7-5-10/h5-7,9H,1-4H2
charge 0 multiplicity 1
23 atoms
O  -3.817458 0.320218 0.836473
O  -0.492137 -2.499134 0.003363
O  4.024381 -0.453472 -0.414821
N  -1.027328 -0.223952 -0.261979
N  2.470232 1.208339 0.161226
C  0.184446 0.234657 0.44718
C  -1.982401 0.771127 -0.790647
C  1.319669 0.621724 -0.540248
C  -2.916834 1.340951 0.299206
C  -1.241596 -1.588821 -0.442815
C  3.727047 0.620527 0.171804
H  0.533795 -0.589234 1.092632
H  -0.077412 1.099345 1.088343
H  -2.603939 0.281507 -1.562557
H  -1.431897 1.599489 -1.278715
H  0.939453 1.331425 -1.301548
H  1.684189 -0.279597 -1.060515
H  -3.580007 2.101639 -0.145286
H  -2.325567 1.822217 1.107879
H  -2.164011 -1.79324 -1.032878
H  2.349035 2.095362 0.655163
H  -3.279075 -0.393175 1.265971
H  4.459614 1.213998 0.766172
