program: Gaussian 09
title: 000259630
version: EM64L-G09RevD.01
frameworkgroup: C1[X(C11H20OSi)]
method: RPBEPBE
basis: SDD
operation: Freq
keyword: #p
keyword: freq=noraman
keyword: PBEPBE/SDD
title: #p freq=noraman PBEPBE/SDD
converged: YES YES NO NO
title: Mulliken charges:
elementType: Si O C C C C C C C C C C C H H H H H H H H H H H H H H H H H H H H
charge: 1.361085 -0.589221 -0.897552 -0.866863 -0.877600 -0.229043 0.003189 0.002034 0.003505 -0.662112 -0.587064 -0.590428 -0.590691 0.265198 0.246060 0.250331 0.245916 0.252724 0.241739 0.213384 0.195736 0.205535 0.239541 0.208266 0.204879 0.223265 0.229780 0.216490 0.220682 0.215693 0.211682 0.215677 0.218183
chargesum: 0.00000
title: Mulliken charges with hydrogens summed into heavy atoms:
elementType: Si O C C C C C C C C C C C
charge: 1.361085 -0.589221 -0.386294 -0.370617 -0.383137 0.180076 0.208725 0.241575 0.211771 -0.004188 -0.149893 -0.163053 -0.156831
polarizability: 1.93313483e+02 -9.63546924e+00 1.39222042e+02 8.74536397e+00 -2.38452667e+00 1.11584605e+02
1716.lowfreq: -47.6734 -15.1641 -0.0020 -0.0019 0.0005 6.5447 10.9239 30.6721 43.1653
frequency: -45.8641 30.2423 43.0439 48.8930 57.2854 61.4465 68.2366 78.5543 101.5536 119.6023 135.3399 170.0225 198.9706 214.0454 237.1372 252.2592 311.8528 345.6428 383.7994 394.9372 398.9284 406.6968 506.3651 586.2080 606.4358 633.9594 709.5177 717.3367 754.5272 792.6858 801.0780 810.5702 835.0263 913.2161 922.1279 928.3094 929.4686 929.8209 933.1905 934.5356 996.1827 999.6817 1007.5017 1036.4378 1047.7402 1054.0438 1062.3073 1089.1849 1146.6408 1168.1095 1174.4325 1187.7203 1200.7549 1205.9467 1212.9873 1261.2015 1286.9063 1290.6174 1301.0132 1352.1769 1382.3544 1408.8928 1411.4410 1411.9082 1433.8244 1437.9195 1439.0285 1457.7741 1473.8581 1488.9641 1644.1327 1645.6301 1646.1331 2963.2818 2973.7005 2979.4825 2979.9603 2980.8875 3030.8341 3044.9206 3050.1523 3050.9095 3075.2383 3076.2279 3077.4696 3082.7461 3092.4513 3092.9993 3094.0348 3104.2251 3193.3292 3196.4719 3197.2204
redmass: 2.0370 3.3332 3.3294 3.1572 3.7626 2.7829 3.4023 2.8691 2.2590 2.4711 2.3020 3.0713 2.0222 2.4347 1.5755 2.8876 2.8687 2.6923 2.6449 2.0192 1.9899 2.0528 2.2698 1.8255 2.0535 3.4250 2.0355 2.0961 1.7962 1.1065 2.8132 1.6613 1.6659 2.3410 1.3668 1.4905 1.7224 1.4726 1.8502 1.8765 1.1093 1.1093 1.1130 1.3336 1.9086 2.0240 1.5683 2.0607 1.6423 1.4794 1.3566 1.4799 1.4213 1.3574 1.3482 1.1217 1.2211 1.2049 1.2217 1.2247 1.2358 1.1191 1.1297 1.1312 1.1537 1.1485 1.1466 1.0456 1.0482 1.0770 4.5290 4.5508 4.5243 1.0607 1.0597 1.0593 1.0559 1.0401 1.1021 1.0973 1.0983 1.0975 1.0788 1.0961 1.0772 1.0597 1.0765 1.0761 1.1010 1.0939 1.1143 1.1148 1.1149
irintensity: 0.4827 1.2356 0.2230 0.2652 0.1298 0.7932 0.5984 0.4786 0.4469 1.2068 1.9456 2.4162 1.9319 3.5907 1.5331 2.0905 3.1359 6.6319 7.0121 1.4726 8.3940 18.8159 0.3803 58.5269 63.8313 64.8865 1.7475 2.8264 23.0457 3.0716 7.3637 13.6742 108.6677 34.0353 126.0789 74.4233 42.8539 25.6282 40.7052 3.0299 3.5394 27.6042 11.1702 11.1971 120.2945 82.9508 55.4956 25.0151 35.2536 82.3870 90.0062 3.7717 13.9972 1.5193 5.8605 3.8772 0.2302 0.1937 0.3649 12.6353 28.5687 5.6088 13.1410 1.9101 12.6681 30.9624 4.2556 8.9831 2.9401 4.3490 52.4218 1.3129 47.1665 43.6627 12.4991 14.1941 6.1037 38.0703 26.5413 1.6485 8.8563 0.6008 12.4913 64.8270 35.5133 10.1354 7.7868 4.9020 41.9892 10.3042 40.1544 22.1967 23.2212
temp: 298.150 k
press: 1.00000 atm
elementType: 14 8 6 6 6 6 6 6 6 6 6 6 6 1 1 1 1 1 1 1 1 1 1 1 1 1 1 1 1 1 1 1 1
symmnumber: 1
zpe: 729739.2 jmol-1
zpe.correction: 0.277943 hartree
zpe.thermalcorrener: 0.295515 hartree
zpe.thermalcorrenthalpy: 0.296459 hartree
zpe.thermalcorrgfe: 0.230683 hartree
zpe.sumelectzpe: -794.707421 hartree
zpe.sumelectthermal: -794.689849 hartree
zpe.sumelectthermalent: -794.688905 hartree
zpe.sumelectthermalfe: -794.754681 hartree
dipole: -0.8931 -0.4737 0.7371
dipole: 1.2511
quadrupole: -88.4156 -87.6067 -90.7523
quadrupole: -2.9533 -1.1006 2.4004
quadrupole: 0.5093 1.3181 -1.8274 -2.9533 -1.1006 2.4004
hfenergy: -794.9853643 hartree
pointgroup: C01 [X(C11H20O1Si1)]
dipole: -0.2927728 -0.3017455 0.2559897 debye
polarizability: 193.6571649|5.4542649|138.0316961|11.9082089|2.6718267|112.4312694 unknown
InChI: InChI=1S/C11H20OSi/c1-5-9-13(10-6-2,11-7-3)12-8-4/h5-7H,1-3,8-11H2,4H3
charge 0 multiplicity 1
33 atoms
Si -0.059155 0.07127 -0.613123
O  -1.125295 1.445588 -0.482642
C  0.49735 -0.538744 1.132878
C  1.421569 0.756426 -1.624275
C  -0.925502 -1.357387 -1.584695
C  -2.266898 1.59907 0.427029
C  1.300074 -1.816895 1.054361
C  2.044713 1.970913 -0.976248
C  -1.982577 -2.085558 -0.789789
C  -1.88669 2.467228 1.635157
C  2.652738 -1.909389 1.15715
C  3.291717 2.023569 -0.437734
C  -3.3256 -1.988145 -0.977105
H  1.09307 0.273586 1.589531
H  -0.408716 -0.684718 1.754443
H  2.166552 -0.051443 -1.753073
H  1.028755 1.015109 -2.628463
H  -1.359746 -0.91235 -2.500314
H  -0.127607 -2.05974 -1.902482
H  -3.064734 2.090913 -0.160319
H  -2.651448 0.611683 0.756914
H  0.7258 -2.741309 0.881113
H  1.402311 2.862674 -0.930942
H  -1.613817 -2.741018 0.015628
H  -2.77319 2.655758 2.270911
H  -1.11374 1.975926 2.252921
H  -1.489898 3.439242 1.293901
H  3.168256 -2.872509 1.07252
H  3.276047 -1.02474 1.33784
H  3.673359 2.937534 0.031102
H  3.966219 1.15794 -0.460269
H  -4.032919 -2.540187 -0.348114
H  -3.751198 -1.358395 -1.76821
