program: Gaussian 09
title: 000259677
version: EM64L-G09RevD.01
frameworkgroup: C1[X(C16H12INO4)]
method: RPBEPBE
basis: SDD
operation: Freq
keyword: #p
keyword: freq=noraman
keyword: PBEPBE/SDD
title: #p freq=noraman PBEPBE/SDD
converged: YES YES NO NO
title: Mulliken charges:
elementType: I O O O O N C C C C C C C C C C C C C C C C H H H H H H H H H H H H
charge: 0.099245 -0.301012 -0.246323 -0.194426 -0.211382 0.030957 0.280979 0.316914 0.089052 -0.404342 -0.352472 0.494078 -0.344293 -0.234360 -0.226799 -0.532450 -0.321043 0.152518 -0.171595 -0.239717 -0.224145 -0.497594 0.277796 0.261676 0.277639 0.239221 0.241182 0.276835 0.252396 0.238298 0.240959 0.241526 0.252764 0.237920
chargesum: 0.00000
title: Mulliken charges with hydrogens summed into heavy atoms:
elementType: I O O O O N C C C C C C C C C C C C C C C C
charge: 0.099245 -0.301012 -0.246323 -0.194426 -0.211382 0.030957 0.280979 0.316914 0.089052 -0.126546 -0.090797 0.494078 -0.066653 0.004861 0.014383 -0.532450 -0.044208 0.152518 0.080800 -0.001418 0.016813 0.234615
polarizability: 2.99524199e+02 -2.44844051e+01 2.86527707e+02 7.41118722e+00 -9.77005681e+00 1.07879777e+02
1716.lowfreq: -3.7874 -0.0009 -0.0008 -0.0005 2.1572 7.5249 18.0766 24.4567 35.1383
frequency: 17.5048 24.4410 35.1189 48.7566 55.2219 69.4459 76.8386 90.3247 100.6398 123.1836 158.0289 165.5425 176.4944 187.6600 219.4125 256.5289 269.7799 292.2643 311.2722 328.8897 393.3946 395.9317 424.1702 442.9167 451.2870 496.0081 510.6977 534.8312 578.3705 616.3370 641.2064 643.7290 680.0401 682.3609 711.9266 733.0386 750.1508 762.1214 775.6127 788.9764 791.0022 838.7654 859.1325 884.4690 907.4062 916.8811 946.3691 957.6437 982.6622 987.6510 992.5374 1008.0263 1040.0938 1044.6422 1076.4733 1106.4424 1114.2696 1115.6141 1152.7732 1175.7475 1179.0107 1199.0192 1202.3404 1240.9147 1253.4536 1276.3694 1285.3252 1320.6663 1363.5884 1370.7393 1374.4724 1416.5410 1421.0130 1433.0091 1442.5567 1451.6424 1462.2467 1477.0607 1557.5430 1572.3377 1588.6736 1602.6025 1622.5589 1638.1094 3008.1417 3091.2856 3113.8264 3135.0947 3140.9256 3146.5884 3152.0118 3158.5747 3158.6581 3172.6655 3175.2932 3200.6382
redmass: 7.7144 6.4108 5.1137 6.1696 6.8136 3.4410 1.8272 3.7609 4.5722 4.7699 5.5549 6.0311 5.9609 5.3321 5.6435 8.0084 6.5767 5.4646 5.3839 7.6002 7.3171 3.8369 5.2610 3.3292 5.0631 4.7349 3.7294 6.1913 6.7847 5.7412 6.0639 6.6579 5.3761 5.3721 4.3688 4.8010 1.5003 3.6856 4.4110 2.1768 2.8314 4.6508 1.3450 1.5075 1.5032 7.0645 1.7078 3.3053 1.4195 1.3493 6.7104 1.3487 3.2405 2.1968 2.8195 2.1222 1.6423 1.3760 1.4872 1.0683 1.0654 2.6438 5.8646 2.4907 3.2311 1.7600 1.6122 1.5949 3.8207 8.3324 10.4790 2.1947 1.2246 2.1873 2.3825 1.0526 1.0529 2.6181 5.5975 6.7936 6.6657 6.6026 9.1687 8.4801 1.0291 1.0859 1.1049 1.0864 1.0866 1.0903 1.1052 1.0926 1.0944 1.1006 1.0977 1.0949
irintensity: 0.8139 0.4256 1.1932 1.0377 1.1644 1.1949 0.1522 1.6550 3.8264 0.2283 0.7370 0.6475 0.3922 2.5419 1.9119 2.3889 6.6882 0.5247 8.2342 4.6281 0.7615 3.7022 7.7611 12.7977 3.1218 3.9891 0.6436 2.1971 13.6004 11.7232 6.0372 19.5848 18.3016 20.1123 8.9646 9.0623 35.5886 15.9135 15.7778 6.1922 73.0545 10.7596 9.8084 13.8697 1.4765 11.4620 8.9202 11.0431 2.8459 0.7815 53.8416 0.5162 52.8189 7.5781 32.2907 45.6535 4.5888 5.7301 27.4291 0.9276 0.0111 27.6291 155.5415 49.2498 153.2336 4.9255 13.4450 52.0177 13.0486 134.7571 8.4368 34.3712 24.2291 8.9826 16.7351 12.2019 5.7667 2.7447 11.8837 8.2320 15.1291 69.7395 174.7041 40.6059 29.1429 5.8163 17.7474 0.5539 1.7265 6.3686 10.4634 12.8715 3.1665 22.3101 14.6765 4.4331
temp: 298.150 k
press: 1.00000 atm
elementType: 53 8 8 8 8 7 6 6 6 6 6 6 6 6 6 6 6 6 6 6 6 6 1 1 1 1 1 1 1 1 1 1 1 1
symmnumber: 1
zpe: 635962.1 jmol-1
zpe.correction: 0.242225 hartree
zpe.thermalcorrener: 0.262753 hartree
zpe.thermalcorrenthalpy: 0.263697 hartree
zpe.thermalcorrgfe: 0.188797 hartree
zpe.sumelectzpe: -982.402797 hartree
zpe.sumelectthermal: -982.382269 hartree
zpe.sumelectthermalent: -982.381325 hartree
zpe.sumelectthermalfe: -982.456225 hartree
dipole: -2.8765 -0.4152 -3.2095
dipole: 4.3299
quadrupole: -142.8933 -114.7379 -152.6825
quadrupole: -9.0607 -4.7002 -6.3358
quadrupole: -6.1221 22.0333 -15.9112 -9.0607 -4.7002 -6.3358
hfenergy: -982.6450223 hartree
pointgroup: C01 [X(C16H12I1N1O4)]
dipole: -0.8587994 -0.312957 -1.4375152 debye
polarizability: 315.1650852|-13.581606|261.4602824|19.0401337|34.67993|117.3063143 unknown
InChI: InChI=1S/C16H12INO4/c1-22-16(19)13-8-4-3-7-12(13)15(18(20)21)10-11-6-2-5-9-14(11)17/h2-10H,1H3
charge 0 multiplicity 1
34 atoms
I  -2.503103 -3.210249 -1.114435
O  1.517154 2.281697 0.055183
O  3.833496 2.457594 0.041446
O  0.957635 0.216158 2.444696
O  -0.872344 1.371834 1.741124
N  0.097615 0.547657 1.538642
C  1.640709 -0.580264 -0.097057
C  0.259312 -0.091949 0.208968
C  2.798031 0.257288 -0.179159
C  -0.800733 -0.396432 -0.602547
C  1.798403 -1.972299 -0.322816
C  -2.254232 -0.132902 -0.537441
C  4.062261 -0.320282 -0.46284
C  3.058778 -2.533692 -0.616782
C  4.200489 -1.70443 -0.680938
C  -3.184925 -1.176762 -0.823609
C  -2.79059 1.174537 -0.340606
C  2.801475 1.745478 -0.012315
C  -4.574511 -0.948877 -0.88223
C  -4.175269 1.419015 -0.419503
C  -5.071276 0.359766 -0.683437
C  1.428956 3.743718 0.281606
H  -0.503503 -0.985067 -1.482839
H  0.921145 -2.622628 -0.237293
H  4.926702 0.34959 -0.51117
H  3.14784 -3.61316 -0.778737
H  5.185383 -2.130796 -0.897257
H  -2.097511 1.991026 -0.134542
H  -5.262118 -1.775511 -1.080741
H  -4.553279 2.435313 -0.269064
H  -6.15008 0.540141 -0.737288
H  1.77177 4.282409 -0.617548
H  2.052288 4.032641 1.143467
H  0.364428 3.930038 0.480364
