program: Gaussian 09
title: 000259613
version: EM64L-G09RevD.01
frameworkgroup: C1[X(C8H16N2O3)]
method: RPBEPBE
basis: SDD
operation: Freq
keyword: #p
keyword: freq=noraman
keyword: PBEPBE/SDD
title: #p freq=noraman PBEPBE/SDD
converged: YES YES NO NO
title: Mulliken charges:
elementType: O O O N N C C C C C C C C H H H H H H H H H H H H H H H H
charge: -0.437342 -0.215288 -0.283601 -0.383219 -0.521324 -0.037336 -0.152268 -0.362156 -0.743579 -0.724595 0.133184 0.208697 -0.520912 0.232359 0.307260 0.196419 0.208292 0.212629 0.225827 0.226525 0.325914 0.205138 0.214151 0.264768 0.223408 0.245320 0.388339 0.289359 0.274031
chargesum: 0.00000
title: Mulliken charges with hydrogens summed into heavy atoms:
elementType: O O O N N C C C C C C C C
charge: -0.049003 -0.215288 -0.283601 -0.057305 0.042066 0.195023 0.154992 0.042555 -0.078597 -0.040538 0.133184 0.208697 -0.052185
polarizability: 1.23241083e+02 3.56634204e+00 1.12073978e+02 1.44108566e-01 -6.42096169e+00 9.52155604e+01
1716.lowfreq: -13.5125 -0.0009 -0.0009 0.0001 1.5835 8.4486 35.4668 47.5879 51.2905
frequency: 35.4144 47.4314 51.2756 66.4899 73.7936 109.2089 118.6787 146.2621 193.5688 205.5324 216.0958 235.6062 244.9455 279.9849 301.2809 352.4818 367.2150 425.6059 473.0867 538.2578 549.9049 580.3670 599.5935 628.1173 668.8215 678.0045 746.3854 782.9144 817.0732 841.8187 892.1197 903.2191 923.7314 962.6317 1010.4833 1040.2161 1049.5340 1075.4542 1110.3567 1133.2783 1138.5026 1161.3594 1173.9311 1221.0587 1250.7694 1260.7677 1288.5217 1293.0290 1304.1024 1319.1159 1336.1559 1342.4872 1349.1210 1394.1992 1397.0170 1441.4518 1463.8423 1474.9668 1477.3338 1481.6689 1488.7479 1501.4414 1617.4254 1663.5300 1665.9967 2972.9222 2975.8223 2977.2225 2978.9782 2991.2749 3025.4064 3027.0091 3036.2585 3067.6628 3069.8823 3076.8906 3083.8309 3444.2418 3519.5737 3546.5176 3559.8090
redmass: 2.5115 4.2562 8.6706 2.9891 4.1275 2.7256 2.6060 4.0016 1.6956 1.2505 1.6230 1.8973 1.4983 4.3084 3.2099 4.9607 2.8052 2.7579 2.8637 2.4281 3.6967 1.7640 1.9672 1.7080 2.4203 2.6415 2.2241 1.5210 2.2251 3.6256 1.5676 2.4312 4.8004 1.2212 1.4829 2.3516 2.5319 2.5502 2.4946 2.0661 1.6343 2.3283 2.2765 1.9744 1.2752 1.2239 1.9007 1.2785 1.4123 1.3551 1.4477 1.2723 1.4863 1.2140 1.1985 1.0891 1.0739 1.0779 1.1116 1.1878 1.3677 1.0484 6.3481 1.0837 9.0635 1.0551 1.0382 1.0398 1.0602 1.0834 1.0962 1.0859 1.1019 1.0995 1.0988 1.0987 1.1002 1.0458 1.0642 1.0770 1.0954
irintensity: 0.3087 3.8910 1.1952 3.3169 3.3756 0.6466 0.4541 1.6880 35.9497 20.9132 13.1951 3.0201 0.8256 40.6492 0.9138 21.0127 4.2993 1.0783 17.1419 38.2079 30.7021 22.2817 54.1447 102.5485 71.1418 78.2715 273.5724 18.7286 3.9348 41.6183 7.2864 23.7382 15.9218 7.0270 8.1507 13.5194 18.3024 180.6865 14.0146 3.9266 12.4065 12.0883 0.4831 47.8234 10.6221 21.1955 26.8575 26.6606 6.6545 5.9234 2.3966 2.1461 1.4005 18.3720 26.5557 10.8849 5.1648 30.8099 61.5151 32.3070 126.8756 13.7708 136.6164 34.3303 223.6283 14.9487 57.7621 13.6308 31.7661 8.5436 17.7123 25.8473 20.0172 14.6220 68.4136 28.8710 33.1381 1.8092 31.8153 29.5055 2.8004
temp: 298.150 k
press: 1.00000 atm
elementType: 8 8 8 7 7 6 6 6 6 6 6 6 6 1 1 1 1 1 1 1 1 1 1 1 1 1 1 1 1
symmnumber: 1
zpe: 636031.0 jmol-1
zpe.correction: 0.242251 hartree
zpe.thermalcorrener: 0.258069 hartree
zpe.thermalcorrenthalpy: 0.259013 hartree
zpe.thermalcorrgfe: 0.198121 hartree
zpe.sumelectzpe: -648.592919 hartree
zpe.sumelectthermal: -648.577102 hartree
zpe.sumelectthermalent: -648.576158 hartree
zpe.sumelectthermalfe: -648.637050 hartree
dipole: -1.1037 -1.7200 2.6610
dipole: 3.3552
quadrupole: -91.1707 -70.3778 -82.6709
quadrupole: -0.5966 -6.0630 0.7796
quadrupole: -9.7642 11.0286 -1.2644 -0.5966 -6.0630 0.7796
hfenergy: -648.8351706 hartree
pointgroup: C01 [X(C8H16N2O3)]
dipole: 0.4357652 0.5866877 1.0992789 debye
polarizability: 121.3243281|6.2623499|111.482408|-3.1315204|7.9673124|97.7238855 unknown
InChI: InChI=1S/C8H16N2O3/c1-3-5(2)7(8(12)13)10-6(11)4-9/h5,7,10,12H,3-4,9H2,1-2H3
charge 0 multiplicity 1
29 atoms
O  0.738195 2.541261 0.488319
O  2.194795 1.924872 -1.211659
O  -1.833572 -0.975203 -0.967178
N  -0.534318 0.225669 0.552288
N  -4.223101 -0.488365 0.555686
C  1.793385 -0.768813 0.225929
C  0.67575 0.220924 -0.276539
C  1.337402 -2.246245 0.108885
C  2.236474 -0.436632 1.66972
C  1.094199 -2.736399 -1.335189
C  1.281073 1.614015 -0.42063
C  -1.720602 -0.354086 0.134186
C  -2.903699 -0.223019 1.13244
H  2.653387 -0.61467 -0.457431
H  0.365599 -0.106349 -1.287217
H  2.123523 -2.869714 0.580951
H  0.419502 -2.393601 0.712494
H  1.410507 -0.606233 2.385979
H  3.074641 -1.090573 1.970061
H  2.576776 0.610229 1.77597
H  -0.532275 0.818854 1.384471
H  1.97028 -2.531592 -1.97968
H  0.914808 -3.827048 -1.349242
H  0.205096 -2.254942 -1.778762
H  -2.898714 0.786735 1.586832
H  -2.723203 -0.93847 1.959386
H  1.186313 3.42124 0.363674
H  -4.270278 -1.415826 0.117084
H  -4.512346 0.228284 -0.11993
