program: Gaussian 09
title: 000259641
version: EM64L-G09RevD.01
frameworkgroup: C1[X(C20H18O)]
method: RPBEPBE
basis: SDD
operation: Freq
keyword: #pfreq=noraman
keyword: PBEPBE/SDD
title: #p freq=noraman PBEPBE/SDD
converged: YES YES NO NO
title: Mulliken charges:
elementType: O C C C C C C C C C C C C C C C C C C C C H H H H H H H H H H H H H H H H H H
charge: -0.435932 0.361433 0.384927 -0.712621 -0.715718 -0.046415 0.498491 0.385761 -0.382685 -0.441786 -0.251917 -0.371446 -0.443466 -0.435253 -0.340691 -0.231468 -0.221641 -0.220755 -0.229569 -0.247941 -0.241697 0.209072 0.254698 0.237208 0.239188 0.234588 0.233868 0.223555 0.256670 0.223360 0.244109 0.252870 0.372847 0.219933 0.221156 0.230647 0.230658 0.224175 0.231789
chargesum: 0.00000
title: Mulliken charges with hydrogens summed into heavy atoms:
elementType: O C C C C C C C C C C C C C C C C C C C C
charge: -0.063085 0.361433 0.384927 -0.248852 -0.239323 -0.046415 0.498491 0.385761 -0.148097 -0.207918 -0.028362 -0.114776 -0.220106 -0.191143 -0.087821 -0.011535 -0.000486 0.009892 0.001089 -0.023766 -0.009909
polarizability: 2.45820445e+02 -1.61293828e+01 2.24829877e+02 2.29099124e+01 -2.50128381e-01 1.53303978e+02
1716.lowfreq: -5.1431 -0.0005 -0.0005 -0.0004 3.8615 6.6694 14.5254 22.5056 33.3640
frequency: 13.9393 22.4337 33.3275 45.5060 52.1382 67.1674 129.5680 176.9566 198.8500 226.2281 242.1288 269.1439 301.6567 306.5157 359.0456 402.6182 403.8441 437.9999 453.3412 471.0200 491.9502 497.2281 523.6605 541.2983 556.8022 589.2832 615.4027 617.5420 644.0395 670.2543 704.4988 705.7795 744.6123 750.8504 761.0999 774.0897 806.5673 819.9090 836.8779 854.0750 860.7154 900.2288 902.9466 919.4136 934.6655 941.7019 967.7545 972.9145 977.2197 983.7758 989.5225 989.8574 993.4882 1001.6053 1026.1313 1026.8054 1070.5210 1079.8509 1084.7803 1156.3955 1166.3115 1170.2024 1173.3510 1177.6372 1182.8932 1186.7696 1189.2742 1198.0448 1206.5611 1220.5973 1256.2003 1293.1108 1298.9023 1310.2263 1329.4965 1337.7470 1379.6579 1381.4671 1392.9735 1438.9754 1440.0093 1448.5910 1463.4622 1464.7009 1473.0104 1481.8753 1482.9891 1589.0656 1592.2493 1599.6371 1609.7931 1612.1658 1618.2229 2970.9634 3003.8621 3024.8947 3064.3804 3112.1922 3114.9758 3116.9043 3120.8146 3125.0931 3125.5573 3133.9105 3137.0057 3144.2726 3148.0698 3157.3459 3160.1615 3165.2298 3473.2897
redmass: 4.0241 4.9278 3.9626 4.0013 5.3306 5.0063 6.2688 4.6189 4.3098 4.1398 4.9039 4.2014 5.7000 2.4009 2.0799 2.7900 2.8331 3.1891 3.3890 1.5060 2.1470 3.7007 5.4136 3.5210 5.3884 4.6140 6.3084 6.2953 4.5760 4.4833 2.0816 1.7917 2.0679 1.8657 1.8628 2.0419 3.5481 4.1413 3.6144 1.2485 1.2450 1.7163 1.5325 1.4225 1.7203 1.9275 1.3955 2.2184 1.3831 1.4149 5.9434 5.8868 1.3163 1.3263 2.2268 2.2289 1.9103 1.6314 1.6896 1.2109 1.6377 1.1232 1.0703 1.3351 1.1655 1.1433 1.1302 2.7095 2.4946 2.1173 1.6199 1.9604 1.5605 1.3511 1.2878 1.3508 6.9944 8.0313 5.4642 2.2125 2.0518 1.9792 1.6325 1.4783 1.7249 2.1133 1.9352 5.9884 6.1176 6.3521 6.1230 6.1248 6.7994 1.0616 1.0607 1.0985 1.1009 1.0863 1.0879 1.0870 1.0863 1.0863 1.0911 1.0919 1.0909 1.0959 1.0959 1.0986 1.1015 1.1014 1.0660
irintensity: 0.0142 0.0081 0.0317 0.3662 1.0732 0.1516 1.6016 2.1017 0.5612 1.1467 2.3015 0.4447 5.0340 2.0126 4.1822 0.8643 0.1948 12.6661 3.0391 58.7912 20.4701 17.2415 6.8539 2.3441 7.2444 4.4607 0.1327 0.7198 17.4532 0.7240 33.0680 63.0982 21.7962 86.7732 30.3603 24.2462 6.8045 10.0078 6.8236 0.0978 0.0287 3.4577 2.6938 2.1067 0.7166 11.6982 2.1138 1.5108 0.0893 0.1210 0.2331 0.4060 0.3537 0.3735 6.9173 9.2246 5.1942 9.5098 43.0476 23.3339 30.5970 3.4066 1.7627 17.6263 7.4645 0.8594 3.5620 0.3277 3.3097 14.5623 6.5563 4.2923 2.7759 15.2311 1.8557 1.2556 0.5264 0.7867 5.4405 14.0125 7.5647 32.6791 22.7770 16.4281 38.6816 16.2461 11.7795 0.6115 0.9227 5.1116 5.8074 12.9226 2.8546 27.4299 30.2115 8.8304 4.3172 8.1329 7.2078 3.2122 0.5818 2.1909 19.3661 22.1219 7.9046 37.2745 30.9341 29.7927 25.4926 23.0508 249.2065
temp: 298.150 k
press: 1.00000 atm
elementType: 8 6 6 6 6 6 6 6 6 6 6 6 6 6 6 6 6 6 6 6 6 1 1 1 1 1 1 1 1 1 1 1 1 1 1 1 1 1 1
symmnumber: 1
zpe: 833585.6 jmol-1
zpe.correction: 0.317496 hartree
zpe.thermalcorrener: 0.335145 hartree
zpe.thermalcorrenthalpy: 0.336089 hartree
zpe.thermalcorrgfe: 0.268810 hartree
zpe.sumelectzpe: -846.696736 hartree
zpe.sumelectthermal: -846.679087 hartree
zpe.sumelectthermalent: -846.678143 hartree
zpe.sumelectthermalfe: -846.745422 hartree
dipole: 2.2466 -0.1695 -0.7825
dipole: 2.3850
quadrupole: -110.6590 -114.6093 -123.6345
quadrupole: -4.9672 5.3196 0.9976
quadrupole: 5.6419 1.6916 -7.3336 -4.9672 5.3196 0.9976
hfenergy: -847.0142319 hartree
pointgroup: C01 [X(C20H18O1)]
dipole: 0.8894552 0.1061028 0.279469 debye
polarizability: 244.7332564|13.0417366|223.7363486|-26.5210548|-9.3199886|155.4846946 unknown
InChI: InChI=1S/C20H18O/c21-20-18(14-16-8-3-1-4-9-16)12-7-13-19(20)15-17-10-5-2-6-11-17/h1-13,21H,14-15H2
charge 0 multiplicity 1
39 atoms
O  0.554544 -0.463677 -1.571626
C  -1.13069 -1.628364 -0.305531
C  1.257539 -1.859141 0.346458
C  -2.201905 -1.036134 -1.219225
C  2.730223 -1.569502 0.07246
C  0.2410 -1.316287 -0.491157
C  -2.889586 0.194793 -0.622715
C  3.102581 -0.083538 0.000134
C  -1.476459 -2.490055 0.762307
C  0.866107 -2.706896 1.408689
C  -0.493089 -3.025987 1.621991
C  -2.16577 1.400702 -0.425583
C  -4.257654 0.157714 -0.254305
C  3.958103 0.399139 -1.025036
C  2.63016 0.83236 0.978247
C  -2.795527 2.536797 0.12736
C  -4.891379 1.293995 0.301686
C  4.339594 1.760757 -1.070136
C  3.01021 2.190872 0.935515
C  -4.161637 2.488355 0.495383
C  3.867424 2.660685 -0.08839
H  -2.964314 -1.810023 -1.426192
H  -1.734283 -0.763354 -2.181519
H  3.038623 -2.056788 -0.875241
H  3.329001 -2.047473 0.871375
H  -2.534134 -2.733137 0.920727
H  1.638468 -3.125772 2.065693
H  -0.781115 -3.686105 2.446772
H  -1.109255 1.440131 -0.714964
H  -4.832129 -0.764932 -0.406664
H  4.334421 -0.296713 -1.785846
H  1.95733 0.474034 1.76627
H  1.478314 -0.107203 -1.481954
H  -2.223646 3.461439 0.269045
H  -5.950775 1.247023 0.57973
H  5.000425 2.115478 -1.868915
H  2.637585 2.88407 1.698053
H  -4.650282 3.370654 0.924374
H  4.160277 3.715884 -0.121368
